S5 Klassifikation Informatik
type: Class
comment: Diese Klasse umfasst alle Instanzen der zugrunde liegenden Systhematik der Informatiksammlung zur Klassifizierung und hierarchischen Einordnung der Sammlungsobjekte in den Bestand. Die Systhematik der Informatiksammlung gliedert sich in einen codierten Identifier (z. B. 1.1.5) und in Klartext (z. B. Elektromechanische Rechenmaschinen). Beispiel: 1 Hardware: Rechengeraete und Bauteile 1.1 Rechenhilfsmittel und -maschinen 1.1.5 Elektromechanische Rechenmaschinen 1.1.5.1 Addiermaschinen 1.1.5.2 Staffelwalzen 1.1.5.3 Sprossenrad 1.1.5.4 Sonstige
subclass of: E55 Type

S27 Insurance Value
type: Class
comment: This class contains quantifiable properties of an object. An instance of class S27_Insurance_Value comprises the amount approximately expressed by values, which the policyholder has to spend for the replacement or restoration of the insured object.
comment: Diese Klasse umfasst quantifizierbare Eigenschaften eines Objektes. Eine Instanz der Klasse S27_Versicherungswert umfasst den durch Werte annaehrend ausgedrueckten Betrag, den der Versicherungsnehmer zur Zeit des Eintrittes des Versicherungsfalles fuer die Wiederbeschaffung oder Wiederherstellung der versicherten Sache aufzuwenden hat.
subclass of: E54 Dimension

N26 beschreibt inhaltlich
type: ObjectProperty
comment: Diese Eigenschaft bezeichnet ein S1_Sammlungsobjekt als Thema eines E33_Linguistic_Object, um es inhaltlich zu beschreiben.
domain: E33 Linguistic Object
range: S1 Collection Object
sub property of: P129 is about
inverse of: N26i wird inhaltlich beschrieben in

N3 hat Klartext
type: ObjectProperty
comment: Diese Eigenschaft beschreibt die Kennzeichnung eines S5_Klassifikation_Informatik durch eine E75_Conceptual_Object_Appellation.
domain: S5 Klassifikation Informatik
range: E75 Conceptual Object Appellation
sub property of: P149 is identified by
inverse of: N3i ist Klartext von

S20 Aufsammelvorgang
type: Class
comment: Diese Klasse umfasst Instanzen einer absichtlichen Handlung, die zum Aufsammeln (inklusive Transport) einer Instanz der Klassen S19_Pflanze oder S83_Fundobjekt durch eine Instanz der Klasse E39_Actor ausgefuehrt wurde. Beispiel: 1. Bauer sammelt antike Scherbe nach Pfluegen seines Ackers auf. 2. Sammler Max Mustermann pflueckt eine Pflanze und bringt sie dem Herbarium Erlangense. 3. Fundobjekt einer Ausgrabung einsammeln.
subclass of: E7 Activity

N31 enthaelt Quadrant ID
type: ObjectProperty
comment: Diese Eigenschaft beschreibt die Verbindung einer E44_Place_Appellation mit einer S42_Messtischblatt, die sich in einer Teil-Ganzen-Beziehung befinden. Ein S42_Messtischblatt enthaelt mindestens einen Quadranten, der durch eine ID identifiziert wird.
domain: S42 Messtischblatt
range: E44 Place Appellation
sub property of: P106 is composed of
inverse of: N31i ist Quadrant ID

S2 Erhaltungszustandstyp
type: Class
comment: Diese Klasse umfasst das Wesen eines Zustands, in dem sich ein materieller Gegenstand befindet. Instanzen der Klasse charakterisieren den Erhaltungszustands einer Instanz der Klasse S1_Sammlungsobjekt im Moment bzw. in einer bestimmten Zeitspanne. Beispiele: 1. leicht/ stark beschaedigt 2. voll funktionsfaehig 3. defekt 4. guter Zustand
subclass of: E55 Type

S62 Estimated Value
type: Class
comment: Diese Klasse umfasst quantifizierbare Eigenschaften eines Objektes. Eine Instanz der Klasse S62_Schaetzwert bildet den durch fachspezifische Kriterien ermittlerte und durch Werte annaehrend ausgedrueckte vermutete Betrag eines Objektes ab.
comment: This class contains quantifiable properties of an object. An instance of class S62_Estimated_Value represents the assumed amount of an object determined by specific criteria and expressed as approximate values.
subclass of: E54 Dimension

S21 Bild
type: Class
comment: Diese Klasse umfasst Verteilungen von Form, Ton und Farbe, die direkt auf elektronischen Medien gefunden werden können. Eine Instanz von S21_Bild repraesentiert visuell eine andere Klasse wie S1_Sammlungsobjekt. Beispiel: Die digitale Aufnahme (S21_Bild) stellt das Sammlungsobjekt "Tischrechner Olivetti Progamma 101" (S1_Sammlungsobjekt) dar und ist unter der URL XY (S65_URL) zu finden.
subclass of: E38 Image

S79 NameEN
type: Class
comment: Diese Klasse umfasst die englischsprachige Uebersetzung einer Instanz der Klasse E48_Place_Name.
subclass of: E44 Place Appellation

S30 Public Comment
type: Class
comment: This class represents text in human language that comments on things or facts and that is intended to be accessable by the public. The feature of being publicly available is regarded to be independent from the objects or facts the text is about, hence it is modelled as part of the class and not as a subproperty of P67, P129, or the like.
subclass of: E33 Linguistic Object

N43i ist berechnetes Messtischblatt von
type: ObjectProperty
comment: Diese Eigenschaft bezeichnet Instanzen von E53_Ort, dessen Messtischblatt aus Referenzdaten berechnet werden.
sub property of: P87i identifies

S55 Former Idientifier
type: Class
comment: This class contains strings or encodings that have been assigned to instances of the class S1_Collection_Object for unique identification in the past. However, this identifier is outdated or unusable in the current context of the collection and has been replaced uniquely and permanently by another instance of the class E42_Identifier or its subclasses. Example: Due to the dissolution and integration of another collection into the own collection, the former inventory numbers are documented.
comment: Diese Klasse umfasst Zeichenketten oder Kodierungen, die den Instanzen der Klasse S1_Sammlungsobjekt zur einzigartigen Identifizierung in der Vergangenheit zugewiesen wurden. Dieser Identifier ist jedoch im aktuellen Kontext der Sammlung veraltet oder unbrauchbar und durch eine andere Instanz der Klasse E42_Identifier bzw. deren Subklassen eindeutig und dauerhaft ersetzt worden. Beispiel: 1. Bei der Umstrukturierung der eigenen Sammlung veraltete Inventarnummern beibehalten. 2. Aufgrund der Aufloesung und Integration einer anderen Sammlung in den eigenen Bestand werden die ehemaligen Inventarnummern dokumentarisch festgehalten.
subclass of: E42 Identifier

S61 Acquisition Price
type: Class
comment: Diese Klasse umfasst quantifizierbare Eigenschaften eines Objektes. Eine Instanz der Klasse S61_Ankaufspreis beschreibt den durch fachspezifische Kriterien ermittelte und durch Werte annaehrend ausgedrueckte Kaufpreis, der fuer ein Objekt zur Anschaffung aufgebracht werden musste.
comment: This class contains quantifiable properties of an object. An instance of the class S61_Acquisition_Price describes the acquisition price determined by specific criteria and expressed by values, which had to be paid for an object.
subclass of: E54 Dimension

S54 Comment
type: Class
comment: Diese Klasse umfasst Texte oder Stichpunkte in einer oder mehrerer natuerlicher Sprachen. Eine Instanz dieser Klasse dient dem naeheren Verstaendnis eines Sachverhalts und liefert vertiefende oder erlaeuternde Informationen.
comment: This class represents text or keywords in natural languange that comments, explains or criticizes on facts or on the meaning of a writing.
subclass of: E33 Linguistic Object

S60 Restoration Measure
type: Class
comment: This class contains instances of explicit and intentional action to restore an instance of the class S1_Sammlungsobjekt.
comment: Diese Klasse umfasst Instanzen expliziter und absichtlicher Handlung, um eine Instanz der Klasse S1_Sammlungsobjekt restauratorisch zu bearbeiten.
subclass of: E11 Modification

N16i wurde aus Sammlung entfernt durch
type: ObjectProperty
comment: Diese Eigenschaft beschreibt ein Sammlungsobjekt, das aufgrund einer Instanz der Klasse S9_Dauerleihgabe aus der Sammlung entfernt wurde.
domain: S1 Collection Object
range: S9 Dauerleihgabe
sub property of: P30i custody transferred through

S49 School Type
type: Class
comment: This class includes all types of schools that can be assigned to class S26_School. An instance of the class describes a level of education in the local school system that leads to a degree corresponding to its school orientation and educational focus. Examples: Primary school, monastery school, boarding school, private school, High School, business school
comment: Diese Klasse umfasst alle Arten von Schulen, die der Klasse S26_Schule zugeordnet werden koennen. Eine Instanz der Klasse beschreibt eine Stufe des Bildungsweg im ortsspezifischen Schulsystem, die zu einem ihrer Schulausrichtung und Bildungsschwerpunkt entsprechenden Abschluss fuehrt. Beispiele: Grundschule, Klosterschule, Internat, Privatschule, Gymnasium, Wirtschaftsschule
subclass of: E55 Type

S32 Telephone Number
type: Class
comment: This class contains identifying indicators in the form of telephone numbers that are used to communicate with instances of class E39_Actor. No distinction is made between mobile and landline numbers. Example: +41 22 418 5571
comment: Diese Klasse umfasst identifizierende Kennzeichen in Form von Telefonnummern, die benutzt werden, um mit Instanzen der Klasse E39_Actor zu kommunizieren. Dabei wird nicht zwischen Mobil- und Festnetzrufnummer unterschieden. Beispiel: +41 22 418 5571
subclass of: E51 Contact Point

N8i stiftete
type: ObjectProperty
comment: Diese Eigenschaft bezeichnet einen E39_Actor, der durch ein Ereignis S8_Erwerb ein Objekt stiftet.
domain: E39 Actor
range: S8 Erwerb
sub property of: P15i influenced

D1 hat Konvolutnotiz
type: DatatypeProperty
comment: Diese Eigenschaft dient der Charakterisierung eines S13_Konvoluts durch eine nicht formale Beschreibungsangabe.
domain: S13 Konvolut
sub property of: P3 has note

N32 enthaelt Messtischblatt
type: ObjectProperty
comment: Diese Eigenschaft beschreibt die Verbindung einer E44_Place_Appellation mit einer S42_Messtischblatt, die sich in einer Teil-Ganzen-Beziehung befinden.
domain: S42 Messtischblatt
range: E44 Place Appellation
sub property of: P106 is composed of
inverse of: N32i ist Messtischblatt in

S67 Authority File ID
type: Class
comment: Diese Klasse umfasst Zeichenketten oder Kodierungen, die Instanzen der Klasse S68_Authority_File zugewiesen werden, um sie eindeutig und dauerhaft zu identifizieren.
subclass of: E42 Identifier

N30 enthaelt Meereshoehe
type: ObjectProperty
comment: Diese Eigenschaft beschreibt die Verbindung einer E44_Place_Appellation mit einer S41_geographische_Koordinaten, die in einer Teil-Ganzen-Beziehung sind. S41_geographische_Koordinaten enthaelt die Angabe einer Meereshoehe.
domain: S41 geographische Koordinaten
range: E44 Place Appellation
sub property of: P106 is composed of
inverse of: N30i ist Meereshoehe in

S13 Konvolut
type: Class
comment: Diese Klasse soll Instanzen der Klasse S1_Sammlungsobjekt zu einer Einheit bzw. Gruppe zusammenfassen, welche aufgrund eines gewissen Sachverhalts, Sinns, Sammlungskonzepts oder "Kompatibilitaet zueinander" verbunden sind. Die Klasse S13_Konvolut ist eine Subklasse von E55_Type. Beispiel aus der Informatik Sammlung: Peripherie-Geraete wie Drucker und Tastatur, die zu einem bestimmten System bzw. Rechner gehoeren und deswegen zu einem Konvolut zusammengestellt wurden.
subclass of: E55 Type

S29 Private Comment
type: Class
comment: This class represents text in human language that comments on objects of facts and that is intended to be disclosed only to a limited group of people. The feature of being private is regarded to be independent from the objects or facts the text is about, hence the privacy is modelled as part of the class and not as a subproperty of P67, P129, or the like.
subclass of: E33 Linguistic Object

S66 Person Institution
type: Class
comment: Diese Klasse umfasst alle Arten von Personen und Institutionen, die als Akteuere fuer die Sammlung relevant sind. Eine Instanz der Klasse S66_Person_Institution beschreibt einen Akteur, der eine Rolle als Stifter, Hersteller, Autor oder aehnliches einnimmt oder als Teil einer Instanz von S73_Information_Object auf einem Sammlungsobjekt erwaehnt wird. Beispiel: Im Naturkundeheft des Schuelers Max Mustermann (S66_Person_Institution) wird der Lehrer Laempel (S66_Person_Institution) auf Seite 12 erwaehnt. Das Heft gelang als Schenkung der Antiquariats XY (S66_Person_Institution) in den Bestand der Sammlung.
subclass of: E39 Actor

S71 Bearbeitung
type: Class
comment: Die Klasse umfasst die Aktionen der Dokumentation, Zeitpunkt der Vergabe einer Inventarnummer oder die Erarbeitung eines Zustandsprotokolls zu einem Objekt durch den Kurator oder einen Sammlungsmitarbeiter. Beispiel: Eingabe eines Objektdatensatzes in die Datenbank der Sammlung durch Mitarbeiter XY.
subclass of: E13 Attribute Assignment

N2 hat Code
type: ObjectProperty
comment: Diese Eigenschaft registriert die bevorzugte S4_Code, die zur Verwendungszeit dieser Eigenschaft gebraucht wurde, um eine Instanz der Klasse E55_Type oder deren Unterklassen im Kontext der Sammlung zu identifizieren.
domain: S5 Klassifikation Informatik
range: S4 Code
sub property of: P48 has preferred identifier
inverse of: N2i ist Code von

S57 Comment On Provenance
type: Class
comment: Diese Klasse umfasst Texte oder Stichpunkte in einer oder mehrerer natuerlicher Sprachen. Eine Instanz dieser Klasse dient dem naeheren Verstaendnis einer Instanz der Klasse S1_Sammlungsobjekt und liefert vertiefende oder erlaeuternde Informationen zur Geschichte dieses Objektes.
comment: This class represents text in natural languange that comments on the provenance of an object or provides an anecdote about the object. Or: S57_Object_Provenance, S57_Provenance
subclass of: E33 Linguistic Object

S41 geographische Koordinaten
type: Class
comment: Diese Klasse umfasst die numerische Information, mit der eine bestimmte Instanz der Klasse E53_Place innerhalb raeumlicher Schemata lokalisiert werden kann. Eine Instanz der Klasse S41_geographische_Koordinaten beschreibt die Lage eines Punktes auf der Erde in Form von Kugelkoordinaten bzw. GPS-Koordinaten. Beispiel: Die Stadt Nuernberg hat die Koordinaten 49° 27′ N , 11° 5′ O.
subclass of: E47 Spatial Coordinates

S31 Email Address
type: Class
comment: This class contains identifying indicators in the form of email addresses that are used to communicate with instances of class E39_Actor. Example: mustermann(at)gmail.com
comment: Diese Klasse umfasst identifizierende Kennzeichen in Form von Email Adressen, die benutzt werden, um mit Instanzen der Klasse E39_Actor zu kommunizieren. Beispiel: mustermann
subclass of: E51 Contact Point

N44i ist berechnete Koordinaten von
type: ObjectProperty
comment: Diese Eigenschaft bezeichnet Instanzen von E53_Ort, deren Koordinaten aus Referenzdaten berechnet werden.
sub property of: P87i identifies

S40 Geographical Place
type: Class
comment: This class comprises structuring geographical elements. (esp. on earth's habitable surface) Geographical Places typically can be referred to by proper place names and categorized by S24_Geographical_Unit. This class comprises man made and natural geographic features, like dwellings, counties, water ways, mountain (ranges), etc. Geographical places may be 3-dimensional and extend into space or earthen ground. (e.g. caves) Examples: - Paris (just the geography, not the physical entity or administrative body! It may, however, be categorized as greographical unit "dwelling" or "city") - The Alps - Tethys
subclass of: E53 Place

S11 Weight
type: Class
comment: Diese Klasse umfasst quantifizierbare Eigenschaften eines Objektes. Eine Instanz der Klasse S11_Gewicht beschreibt das durch geeichte Groessen gemessene und durch Werte annaehrend ausgedrueckte Gewichtsmass eines Objekts. Beispiel: Das Notebook NEC MultiSpeed hat ein Gewicht von 5 kg.
comment: This class contains quantifiable properties of an object. An instance of the class S11_Weight describes the weight of an object measured by calibrated values or approximately expressed by values. Example: The Notebook NEC MultiSpeed has a weight of 5 kg.
subclass of: E54 Dimension

N4 bestimmte
type: ObjectProperty
comment: Diese Eigenschaft bezeichnet den S6_Erhaltungszustand, der waehrend einer S7_Zustandsbestimmung beobachtet wurde.
domain: S7 Zustandsbestimmung
range: S6 Erhaltungszustand
sub property of: P35 has identified
inverse of: N4i wurde bestimmt bei

S64 Abgabe Verkauf
type: Class
comment: Diese Klasse umfasst Instanzen gesetzlich geregelter Abgaben von Besitz, die von Instanzen der Klasse E39_Akteur ausgefuehrt werden. Eine Instanz der Klasse S64_Abgabe_Verkauf beschreibt insbesondere das Ende eines Besitzverhaeltnisses durch Verkauf oder Abgabe eines Sammlungsobjekts durch die Sammlung.
subclass of: E8 Acquisition

N19 hat Erwerbsart
type: ObjectProperty
comment: Diese Eigenschaft erlaubt die konkrete Klassifizierung einer Instanz von S8_Erwerb mittels S10_Zugangsart_oder_Erwerbsart.
domain: S8 Erwerb
range: S10 Type Of Access Or Purchase
sub property of: P2 has type
inverse of: N19i ist Erwerbsart von

S56 Usage Type
type: Class
comment: Diese Klasse umfasst alle Arten von Nutzungsmöglichkeiten und Verwendungszwecke einer Instanz der Klasse S1_Sammlungsobjekt. Beispiele: 1. Der Rechner "COMMODORE PET Series 2001" wird ausgestellt (S56_Nutzungstyp) im 1.OG im Treppenhaus des RRZE. 2. Das Sammlungsobjekt Suanpan (Abakus) wird im Moment für museumspädagogische Zwecke (S56_Nutzungstyp) benutzt.
comment: This class comprises all types of usage possibilities of an instance of class S1_Sammlungsobjekt. Examples: The computer "COMMODORE PET Series 2001" will be exhibited (S56_Usage_Type) on the 1st floor in the staircase of the RRZE. The Suanpan (Abakus) collection object is currently being used for museum educational purposes (S56_Usage_Type).
subclass of: E55 Type

S39 Location
type: Class
comment: A location is a place that is used to locate things on a sub-geographical level. Other than geographical places they may not have a place name but are described / circumscribed. A location may be specified by spatial coordinates, though. For geographical reference, a location can be linked to the / a geographical place that it is in. Example: - An specific individual plant was found "under the first oak tree to the left of the main gate". - An object's location is on shelf "XII-3". - An object was found "in the remnants of building X". (where building X could be the surrounding geographical place.
subclass of: E53 Place

S63 Type Of Levy
type: Class
comment: This class classifies all types of collection levy to remove an instance of the class S1_Sammlungsobjekt from the collection by an instance of the class S64_Abgabe_Verkauf. Example: sale, disposal, delivery
comment: Diese Klasse klassifiziert alle Arten von Besitzabgabe, um eine Instanz der Klasse S1_Sammlungsobjekt durch eine Instanz der Klasse S64_Abgabe_Verkauf aus der Sammlung zu entfernen. Beispiel: 1. Verkauf 2. Entsorgung 3. Abgabe
subclass of: E55 Type

N25 enthaelt Vorname
type: ObjectProperty
comment: Diese Eigenschaft beschreibt die Verbindung einer E82_Actor_Appellation mit einer anderen E82_Actor_Appellation, die sich in einer Teil-Ganze-Beziehung befinden. Der vollstaendige Name einer Person enthaelt mindestens einen Vornamen.
domain: E82 Actor Appellation
range: E82 Actor Appellation
sub property of: P106 is composed of
inverse of: N25i ist Vorname in

S14 Status
type: Class
comment: This class comprises the current status of an object in an administrative meaning. Example: The painting "Mona Lisa" is not available for loan. Second "Five Dancing Women" by Edgar Degas is missing. (or: S14_Administrative_Status)
comment: Diese Klasse umfasst den aktuellen Status eines Sammlungsobjektes im verwaltungstechnischen Sinn. S14_Status ist eine Subklasse von E55_Type. Beispiel: 1. Das Gemaelde "Mona Lisa" ist nicht ausleihbar. 2. "Fuenf tanzende Frauen" von Edgar Degas hat den Status verschollen.
subclass of: E55 Type

S65 URL
type: Class
comment: Diese Klasse umfasst die Identifikationsbezeichnung URL (Uniform Resource Locator), um eine Resource im Computernetzwerk zu identifizieren und zu lokalisieren.
comment: This class includes the identifier URL (Uniform Resource Locator) to identify and locate a resource on the computer network.
subclass of: E51 Contact Point

S35 Zeitspanne Start
type: Class
comment: Diese Klasse umfasst Datumsangaben. Eine Instanz der Klasse gibt den moeglichst exakten Start einer Instanz der Klasse E52_Time-Span wieder. Instanzen von S35_Zeitspanne_Start enthalten keine Praepositionen bzw. weiche Datierungsparameter, sondern nur konkrete Datumsangaben. Um ungefaehre Zeitangaben zu beschreiben sollte die Klasse E52_Time_Span genutzt werden. (eventuell zu loeschen) Beispiel: Der Produktion des Mikroprozessors WinChip C6 wurde 1997 begonnen.
subclass of: E50 Date

S58 Funktionszustandstyp
type: Class
comment: Diese Klasse umfasst das Wesen eines Zustands, in dem sich ein materieller Gegenstand befindet. Eine Instanz der Klasse beschreibt speziell die Funktionstuechtigkeit eines Objektes.
subclass of: S2 Erhaltungszustandstyp

S6 Erhaltungszustand
type: Class
comment: Diese Klasse umfasst den Erhaltungszustand von Objekten in einem bestimmten Zeitraum. Eine Instanz dieser Klasse beschreibt die physische Beschaffenheit eines materiellen Gegenstands waehrend eines bestimmten Zeitraums E52_Time-Span. Das Wesen des entsprechenden Zustands kann durch die Klasse S2_Erhaltungszustandstyp charakterisiert werden. Beispiel: Die Zustand der Fotografie "Klassenfoto einer Maedchenklasse" am 17.2.2017 um 15 Uhr P2_hat_den_Typus leicht beschaedigt (S2_Erhaltungszustandstyp).
subclass of: E3 Condition State

S78 NameFR
type: Class
comment: Diese Klasse umfasst die franzoesischsprachige Uebersetzung einer Instanz der Klasse E48_Place_Name.
subclass of: E44 Place Appellation

N35 ist zusammengesetzt aus
type: ObjectProperty
comment: Diese Eigenschaft erlaubt die Analyse von Instanzen der Klasse E78_Curated_Holding in ihre Bestandteile. Diese Eigenschaft ziehlt vor allem auf die Dokumentation einer Instanz der Klasse S53_Teilsammlung und die ihr zugehoerigen S1_Sammlungsobjekte ab.
domain: E78 Curated Holding
range: E22 Man-Made Object
sub property of: P46 is composed of
inverse of: N35i ist Teil von

S59 Restoration Type
type: Class
comment: This class comprises all types of restoration techniques and technologies to restore an instance of the class S1_Sammlungsobjekt or part of the instance by an instance of the class S60_Restoration_Measure.
comment: Diese Klasse umfasst alle Arten von Restaurierungstechniken und -technologien, um eine Instanz der Klasse S1_Sammlungsobjekt bzw. ein Teil der Instanz durch eine Instanz der Klasse S60_Restaurierungsmassnahme zu restaurieren.
subclass of: E55 Type

N21 hat Standort
type: ObjectProperty
comment: Diese Eigenschaft registriert den permamenten Standort einer Instanz von S1_Sammlungsobjekt zur Verwendungszeit dieser Eigenschaft.
domain: S1 Collection Object
range: E53 Place
sub property of: P54 has current permanent location
inverse of: N21i ist Standort von

N33 enthaelt geographische Laenge
type: ObjectProperty
comment: Diese Eigenschaft beschreibt die Verbindung einer E44_Place_Appellation mit einer S41_geographische_Koordinaten, die in einer Teil-Ganzen-Beziehung sind. S41_geographische_Koordinaten beinhaltet die Angabe eine geographischer Laenge.
domain: S41 geographische Koordinaten
range: E44 Place Appellation
sub property of: P106 is composed of
inverse of: N33i ist geographische Laenge

S25 Name Abbreviation
type: Class
comment: This class contains character strings that are assigned to the instances of the class E39_Actor in order to be able to identify them additionally by abbreviation of one or more syllable. Example: The author abbreviation L. in the Erlangense Herbarium stands for Linné.
comment: Diese Klasse umfasst Zeichenketten, die den Instanzen der Klasse E39_Actor zugewiesen werden, um sie zusaetzlich ueber eine Abkuerzung von einer Silbe oder einem bzw. mehreren Woertern identifizieren zu koennen. Beispiel: Das Autorenkuerzel L. im Herbarium Erlangense steht fuer Linné.
subclass of: E42 Identifier

S37 Designation
type: Class
comment: Diese Klasse umfasst Zeichenketten, die zur Identifizierung einer konkreten Instanz der Klasse S1_Sammlungsobjekt benutzt werden und die aktuelle Bezeichnung im Forschungs- und Sammlungskontext wiedergibt.
comment: This class contains strings that are used to identify a specific instance of the class S1_Collection_Object and represents the current name in the research and collection context.
subclass of: E35 Title

S24 Geographical Unit
type: Class
comment: This class defines terms that are used to categorize S40 Geographical Places as resembling a certain type of place. No assumptions are made as to how these terms are made up and which rules they follow. Example: - Mountain - City - District - Country - Ocean - Airway
subclass of: E55 Type

S84 Typus UFG
type: Class
comment: Diese Klasse umfasst Konzepte, um Instanzen der Klasse S1_Sammlungsobjekt unter Verwendung von Begriffen aus fachspezifischen Vokabular der Ur- und Fruehgeschichtlichen Sammlung zu charakterisieren und zu klassifizieren.
subclass of: E55 Type

N41 has authority file id
type: ObjectProperty
comment: Diese Eigenschaft registriert die bevorzugte S67_Authority_File_ID, die zur Verwendungszeit dieser Eigenschaft aktuell war, um eine Instanz der Klasse S68_Authority_File eindeutig zu identifizieren.
domain: E1 CRM Entity
range: S67 Authority File ID
sub property of: P48 has preferred identifier
inverse of: N41i is authority file id of

N28 Zeitspanne beginnt
type: ObjectProperty
comment: Diese Eigenschaft legt den Startpunkt einer Zeitspanne fest. die sich in einer anderen Zeitspanne mit einer laengeren Dauer befindet. (eventuell zu loeschen)
domain: E2 Temporal Entity
range: E2 Temporal Entity
sub property of: P116 starts
inverse of: N28i Zeitspanne wurde begonnen mit

S68 Authority File
type: Class
comment: Diese Klasse umfasst Dokumente, die eine Terminologie oder ein konzeptuelles System zur konsistenten Verwendung definieren.
subclass of: E32 Authority Document

S26 School
type: Class
comment: The class includes institutions that act according to a public educational task in order to impart knowledge and skills from teachers to students.
comment: Die Klasse umfasst Institutionen, die nach einem oeffentlichen Bildungsauftag handeln, um Wissen und Koennen durch Lehrer an Schueler zu vermitteln.
subclass of: E40 Legal Body

S9 Dauerleihgabe
type: Class
comment: Die Klasse umfasst unentgeltliche Uebergaben von zum Gebrauch ueberlassene Gegenstaenden zwischen zwei Instanzen der Klasse E39_Actor. Eine Instanz der Klasse S9_Dauerleihgabe beschreibt die durch einen Vertrag geregelte unbefristete Leihe im musealen Kontext. Beispiel: "Der Turmbau zu Babel" von Roelant Savery im Germanischen Nationalmuseum ist eine Dauerleihgabe der Museen der Stadt Nuernberg.
subclass of: E10 Transfer of Custody

N17i entlieh Objekt durch
type: ObjectProperty
comment: Diese Eigenschaft bezeichnet einen E39_Actor, der ein Objekt durch ein Ereignis S9_Dauerleihgabe der Sammlung zur Verfuegung stellt.
domain: E39 Actor
range: S9 Dauerleihgabe
sub property of: P28i surrendered custody through

S83 Discovered Object
type: Class
comment: Diese Klasse umfasst Instanzen der Klassen E20_Biological_Object und E22_Man_Made_Object, die durch eine Instanz der Klasse S20_Aufsammelvorgang aufgrund ihrer einzigartigen Bedeutung fuer die jeweilige Fachdisziplin aufgefunden und eingesammelt wurden.
comment: This class contains instances of the classes E20_Biological_Object and E22_Man_Made_Object, which were found and collected by an instance of the class S20_Aufsammelvorgang due to their unique meaning for the respective discipline.
subclass of: E19 Physical Object

N45 liegt in berechnet
type: ObjectProperty
comment: Diese Eigenschaft bezeichnet Instanzen von E53_Ort, deren Flaechen in das Gebiet eines anderen Ortes fallen und aus Referenzdaten berechnet werden muessen.
sub property of: P89 falls within
inverse of: N45i beinhaltet berechnet

S36 Zeitspanne Ende
type: Class
comment: Diese Klasse umfasst Datumsangaben. Eine Instanz der Klasse gibt das moeglichst exakte Ende einer Instanz der Klasse E52_Time-Span wieder. Instanzen von S36_Zeitspanne_Ende enthalten keine Praepositionen bzw. weiche Datierungsparameter, sondern nur konkrete Datumsangaben. Um ungefaehre Zeitangaben zu beschreiben sollte die Klasse E52_Time_Span genutzt werden. (eventuell zu loeschen) Beispiel: Der Produktion des Mikroprozessors WinChip C6 wurde 1999 beendet.
subclass of: E50 Date

N5i wurde fuer Sammlung erworben durch
type: ObjectProperty
comment: Diese Eigenschaft bezeichnet ein S1_Sammlungsobjekt, das Gegenstand eines S8_Erwerbs durch die Sammlung ist.
domain: S1 Collection Object
range: S8 Erwerb
sub property of: P24i changed ownership through

N34 enthaelt geographische Breite
type: ObjectProperty
comment: Diese Eigenschaft beschreibt die Verbindung einer E44_Place_Appellation mit einer S41_geographische_Koordinaten, die in einer Teil-Ganzen-Beziehung sind. S41_geographische_Koordinaten beinhaltet die Angabe eine geographischer Breite.
domain: S41 geographische Koordinaten
range: E44 Place Appellation
sub property of: P106 is composed of
inverse of: N34i ist geographische Breite in

S16 Consecutive Number
type: Class
comment: Diese Klasse umfasst Zeichenketten oder Kodierungen, die Instanzen der Klasse S1_Sammlungsobjekt als Eingangsnummer bei der Aufnahme in die Sammlung zugewiesen werden, um sie eindeutig und dauerhaft zu identifizeren.
comment: This class contains character strings that are automatically assigned to the data records of the instances of the Collection Object class as an input number when they are added to the collection database in order to uniquely and permanently identify the objects. This class is to be used if the consecutive number is to be kept as information when data is imported into another system. Or: S16_Sequential_Number
subclass of: E42 Identifier

N29 Zeitspanne endet
type: ObjectProperty
comment: Diese Eigenschaft legt den Endpunkt einer Zeitspanne fest. die sich in einer anderen Zeitspanne mit einer laengeren Dauer befindet. (eventuell zu loeschen)
domain: E2 Temporal Entity
range: E2 Temporal Entity
sub property of: P115 finishes
inverse of: N29i Zeitspanne wurde beendet mit

S77 NameDE
type: Class
comment: Diese Klasse umfasst die deutschsprachige Uebersetzung einer Instanz der Klasse E48_Place_Name.
subclass of: E44 Place Appellation

S4 Code
type: Class
comment: Diese Klasse umfasst die Kodierung, die den Instanzen der Klasse E55_Type oder deren Unterklassen zugewiesen werden, um sie eindeutig und dauerhaft im Kontext der Sammlung zu identifizieren. Beispiel: Instanzen der Klasse S5_Klassifikation_Informatik wurde neben einer Klartextsysthematik eine Kodierung zugewiesen, um sie eindeutig zu identifizieren. 1 1.1 1.1.5
subclass of: E42 Identifier

S42 Messtischblatt
type: Class
comment: Die Klasse umfasst die textuelle oder numerische Information, die in Deutschland unter der Bezeichnung Messtischblatt gelaeufig ist. Eine Instanz der Klasse S42_Messtischblatt ist eine amtliche topografische Karte im Massstab 1:25.000 (TK 25), mit der eine bestimmte Instanz der Klasse E53_Place innerhalb raeumlicher Schemata lokalisiert werden kann. Beispiel: Das Gebiet Erlangen-Nord ist auf dem Messtischblatt Nr. 6332 zu finden.
subclass of: E47 Spatial Coordinates

S28 Form Of Publication
type: Class
comment: Diese Klasse stellt Konzepte dar, deren kontrolliertes Vokabular sich auf die Erscheinungsform einer Instanz der Klasse S1_Sammlungsobjekt bezieht, um Sammlungsobjekte zu verschlagworten. Diese Klasse wurde zum Beispiel innerhalb der Schulgeschichtlichen Sammlung verwendet, um Sammlungsobjekte, die in Papierform vorhanden sind, zu klassifizieren. Beispiele: 1. Heft 2. Handschrift Schueler/Schuelerin 3. Postkarte 4. Einzelblatt/Einzelblaetter 5. Foto
comment: This class represents concepts whose controlled vocabulary refers to the appearance of an instance of the class S1_Sammlungsobjekt to index collection objects. (This class was used, for example, within the School History Collection (Schulgeschichtliche Sammlung) to classify objects that are available in paper form.) Examples: booklet, manuscript student, postcard, single sheet, photo
subclass of: E55 Type

N42 hat Duplikat
type: ObjectProperty
comment: Diese Eigenschaft beschreibt die Beziehung einer ersten Entitaet mit einer zweiten Entitaet, die ein Duplikat der ersten Entitaet darstellt.
domain: E1 CRM Entity
range: E1 CRM Entity

S1 Collection Object
type: Class
comment: This class includes concrete objects that have been intentionally added by human activity to the inventory of a collection and curated by one or more instances of E39_Actor over time.
comment: Diese Klasse umfasst konkrete Gegenstaende, die von menschlicher Aktivitaet bewusst zum Bestand einer Sammlung hinzugefuegt wurde und kuratorisch betreut werden.
subclass of: E22 Man-Made Object

N24 enthaelt Nachname
type: ObjectProperty
comment: Diese Eigenschaft beschreibt die Verbindung einer E82_Actor_Appellation mit einer anderen E82_Actor_Appellation, die sich in einer Teil-Ganze-Beziehung befinden. Der vollstaendige Name einer Person enthaelt mindestens einen Nachnamen.
domain: E82 Actor Appellation
range: E82 Actor Appellation
sub property of: P106 is composed of
inverse of: N24i ist Nachname in

N11 ist abgebildet auf
type: ObjectProperty
comment: Diese Eigenschaft baut eine Beziehung zwischen S21_Bild und einem S1_Sammlungsobjekt auf, das es visuell repraesentiert.
domain: S1 Collection Object
range: S21 Bild
sub property of: P138i has representation
inverse of: N11i zeigt

S52 User group
type: Class
comment: Diese Klasse klassifiziert Personengruppen bzw. Institutionen, welche mit der Sammlung interagieren. Zum Beispiel zur Unterscheidung der Benutzergruppen, die ein Objekt ausleihen koennen. Die Klasse S52_Benutzergruppe ist eine Subklasse von E55_Type. Beispiel: Studenten, Museen, Dozenten
comment: This class identifies groups of people or institutions that interact with the collection. The class can be used to differentiate between user groups that can borrow an object. Example: Students, museums, lecturers
subclass of: E55 Type

S22 Kategorie Schulgeschichte
type: Class
comment: Diese Klasse umfasst Konzepte, um Instanzen der Klasse S1_Sammlungsobjekt unter Verwendung von Begriffen aus fachspezifischen Vokabular der Schulgeschichtlichen Sammlung detailliert zu klassifizieren und charakterisieren. S22_Kategorie_Schulgeschichte bezieht sich dabei mehr auf die inhaltiche Komponente der Instanz, wie den Titel auf einem in Papierform vorhandenen Sammlungsobjekts. Beispiele: 1. Spickzettel Mathematik, Spickzettel Physik 2. Amtliches Dokument 3. Jahresbericht
subclass of: E55 Type

S8 Erwerb
type: Class
comment: Diese Klasse umfasst Instanzen gesetzlich geregelten Erwerbs von Besitz, die von Instanzen der Klasse E39_Akteur ausgefuehrt werden. Eine Instanz der Klasse S8_Erwerb beschreibt insbesondere den Beginn eines Besitzverhaeltnisses durch Ankauf oder Erwerb (S10_Zugangsart_oder_Erwerbsart) eines Sammlungsobjekts.
subclass of: E8 Acquisition

N15 ergab Praeparat
type: ObjectProperty
comment: Diese Eigenschaft bezeichnet ein S1_Sammlungsobjekt, das das Ergebnis einer S18_Praeparation darstellt.
domain: S18 Praeparation
range: S1 Collection Object
sub property of: P123 resulted in
inverse of: N15i Praeparat entstand durch

S3 Inventory Number
type: Class
comment: Diese Klasse umfasst Zeichenketten oder Kodierungen, die Instanzen der Klasse S1_Sammlungsobjekt zugewiesen werden, um sie eindeutig und dauerhaft innerhalb des Sammlungskontexts zu identifizieren. Beispiele: 1. 7.5.16/102 2. I1053
comment: This class contains strings or encodings that are assigned to instances of class S1_Collection_Object to identify them uniquely and permanently within the collection context. Examples: 1. 7.5.16/102 2. I1053, K0004
subclass of: E42 Identifier

N23i wurde aufgesammelt durch
type: ObjectProperty
comment: Diese Eigenschaft beschreibt die Verwendung eines Fundobjekts oder einer Pflanze, die fuer das Durchfuehren eines Aufsammelvorgangs benoetigt wird.
domain: E19 Physical Object
range: S20 Aufsammelvorgang
sub property of: P16i was used for

N27 beschreibt physisch
type: ObjectProperty
comment: Diese Eigenschaft bezeichnet ein S1_Sammlungsobjekt als Thema eines E33_Linguistic_Object, um seine physischen Charakteristika zu beschreiben.
domain: E33 Linguistic Object
range: S1 Collection Object
sub property of: P129 is about
inverse of: N27i wird physisch beschrieben in

N18i uebergab Objekt durch
type: ObjectProperty
comment: Diese Eigenschaft bezeichnet einen E39_Actor, der seinen rechtmaessigen Besitz durch ein Ereignis S8_Erwerb an die Sammlung abtritt.
domain: E39 Actor
range: S8 Erwerb
sub property of: P23i surrendered title through

S34 Keyword or Tag
type: Class
comment: This class represents keywords and tags used for classification. They are less structured than terms coming from curated thesauri or classification systems. They may be completely unstructured and made up on-the-fly, e.g. by crowd sourcing. Example: "Painting" as a tag with loose / unclear semantics as opposed to the well defined term "paintings" from Getty AAT (300033618)
subclass of: E55 Type

S12 LxWxH
type: Class
comment: This class contains quantifiable properties of an object. An instance of the class S12_LxWxH represents the approximate length of an object, expressed in calibrated sizes and values. This class is not limited to the special format length x width x height. Example: The size of the tablet is 149 x 75 x 4,5 cm.
comment: Diese Klasse umfasst quantifizierbare Eigenschaften eines Objektes. Eine Instanz der Klasse S12_LxBxH bildet das durch geeichte Groessen und durch Werte annaehrend ausgedrueckte Laengenmass eines Objektes ab. Diese Klasse beschraenkt sich dabei nicht auf das spezielle Format Laenge x Breite x Hohe. Beispiel: Die Salaminische Rechentafel hat die Masse 149 x 75 x 4,5 cm.
subclass of: E54 Dimension

N12i besteht aus
type: ObjectProperty
comment: Diese Eigenschaft verbindet mehrere S1_Sammlungsobjekte zu einem S13_Konvolut.
domain: S13 Konvolut
range: S1 Collection Object
sub property of: P103i was intention of

S18 Praeparation
type: Class
comment: Diese Klasse umfasst Ereignisse, welche die grundsaetzliche Natur eines Objektes veraendert. S18_Praeparation beinhaltet die Erhebung eines Objektes zum Sammlungsobjekt, sei dies durch konservatorische, restauratorische Maßnahmen oder durch das Ereignis der Auswahl durch den Kurator geschehen. Beispiele: 1. Pflanzen oder Pflanzenteile werden nach Trocknung durch Pressen zwischen Filterpapieren auf Papier aufgeklebt 2. Fundobjekt wird von Schmutz und Kalk befreit 3. Aufnahme eines Objektes in den Sammlungsbestand
subclass of: E11 Modification

S53 Subcollection
type: Class
comment: This class comprises subcollections of a superordinate collection. These are aggregations of instances of E18_Physical_Thing, which are assembled and maintained by one or more instances of E39_Actor over time for a specific purpose and audience, and according to a particular collection development plan. An instance of the class S53_Subcollection may have been an original independent collection in the past that was integrated into the collection of another collection. Example: The Herbarium Erlangense consists of several subcollections, e. g. Koch-Herbar, Heller-Herbar or ER_Nordbayern.
comment: Diese Klasse umfasst Teilsammlungen einer uebergeordneten Sammlung, die gemaeß der Klasse E78_Curated_Holding Instanzen der Klasse E18 Materielles, die durch eine oder mehrere Instanzen der Klasse E39 Akteur im Lauf der Zeit für einen bestimmten Zweck und Publikum nach einer ausgewiesenen Sammlungsstrategie zusammengesetzt und aufrechterhalten werden. Eine Instanz der Klasse S53_Teilsammlung kann eine urspruenglich eigenstaendige Sammlung in der Vergangenheit gewesen sein, die in den Sammlungsbestand einer anderen Sammlung integriert wurde. Beispiele: 1. Das Erlanger Herbarium besteht aus mehreren Teilsammlungen z. B. Koch-Herbar, Heller-Herbar oder ER_Nordbayern. 2. Das Deutsche Museum hat die Teilsammlungen Foto+ Film, Haushalt, Maschinen, Medizintechnik, Musikinstrumente und Verkehr.
subclass of: E78 Curated Holding

N40 hat URL
type: ObjectProperty
comment: Diese Eigenschaft beschreibt die Kennzeichnung eines E73_Information_Objects durch eine S65_URL.
domain: E73 Information Object
range: S65 URL
sub property of: P1 is identified by
inverse of: N40i URL gehoert zu

D4 hat Ortshierarchie
type: DatatypeProperty
comment: Diese Eigenschaft dient der Charakterisierung eines S40_geographischen_Orts durch eine nicht formale Beschreibungsangabe.
domain: S40 Geographical Place
sub property of: P3 has note

N13 hat Sammler
type: ObjectProperty
comment: Diese Eigenschaft bezeichnet einen S20_Aufsammelvorgang, der von einer E21_Person ausgefuehrt wird.
domain: S20 Aufsammelvorgang
range: E21 Person
sub property of: P14 carried out by
inverse of: N13i sammelte

S82 Hierarchie
type: Class
comment: eventuell zu loeschen (n. b.)
subclass of: E41 Appellation

S33 Annotation
type: Class
comment: This class represents text or keywords in natural languange that comments on things or objects. An instance of this class provides more detailed information of the facts or serves to provide a better understanding of the object.
comment: Diese Klasse umfasst Texte oder Stichpunkte in einer oder mehrerer natuerlicher Sprachen. Eine Instanz dieser Klasse liefert vertiefende oder erlaeuternde Informationen zu einem Objektdatensatz.
subclass of: E33 Linguistic Object

N7 ist klassifiziert als
type: ObjectProperty
comment: Diese Eigenschaft erlaubt die Einordnung eines S1_Sammlungsobjekts in die hierarchisch strukturierte S5_Klassifikation_Informatik.
domain: S1 Collection Object
range: S5 Klassifikation Informatik
sub property of: P2 has type
inverse of: N7i klassifiziert

S50 Vorlage
type: Class
comment: Diese Klasse umfasst die "Echtheit" von Objekten. Sie unterscheidet, ob eine Instanz einer Klasse ein Original oder eine Kopie ist. Beispiel: Zeugnis von Max Mustermann ist im Original in der Schulgeschichtlichen Sammlung vorhanden.
subclass of: E55 Type

N10 liegt in
type: ObjectProperty
comment: Diese Eigenschaft bezeichnet Instanzen von E53_Ort, deren Flaechen in das Gebiet eines anderen Ortes fallen.
domain: E53 Place
range: E53 Place
sub property of: P89 falls within
inverse of: N10i beinhaltet

N6i kam in Sammlung durch
type: ObjectProperty
comment: Diese Eigenschaft beschreibt ein Sammlungsobjekt, das als Dauerleihgabe von einem E39_Actor der Sammlung uebergeben wird.
domain: S1 Collection Object
range: S9 Dauerleihgabe
sub property of: P30i custody transferred through

S10 Type Of Access Or Purchase
type: Class
comment: Diese Klasse klassifiziert alle Arten von Besitzerwerb, um eine Instanz der Klasse S1_Sammlungsobjekt durch eine Instanz der Klasse S8_Erwerb in die Sammlung aufzunehmen. Beispiel: 1. Schenkung 2. Ankauf 3. Stiftung
comment: This class classifies all types of acquisition of ownership to include an instance of class S1_Sammlungsobjekt in the collection by an instance of class S8_Acquisition. Example: donation, purchase, foundation
subclass of: E55 Type

S72 Old ID
type: Class
comment: This class refers to the unique (automatically) assigned ID within the database, not to a former identifier of curatorial origin. Class S55_Former_Identifier exists for an obsolete identifier by the collection or its curator.
comment: Diese Klasse bezieht sich auf die eindeutige (automatisch) vergebene ID innerhalb der Datenbank, nicht auf einen ehemaligen Identifier kuratorischen Ursprungs. Fuer einen veralteten Identifier durch die Sammlung bzw. deren Kurator existiert die Klasse S55_ehemaliger Identifier.
subclass of: E42 Identifier

N1 hat Inventarnummer
type: ObjectProperty
comment: Diese Eigenschaft registriert die bevorzugte S3_Inventarnummer, die zur Verwendungszeit dieser Eigenschaft gebraucht wurde, um eine Instanz der Klasse S1_Sammlungsobjekt zu identifizieren.
domain: S1 Collection Object
range: S3 Inventory Number
sub property of: P48 has preferred identifier
inverse of: N1i ist Inventarnummer von

S7 Zustandsbestimmung
type: Class
comment: Diese Klasse umfasst die Feststellung des Zustands eines Objekts waehrend einer bestimmten Zeitspanne, um die Umstaende der jeweiligen Erhebung qualitativ zu beurteilen und zu dokumentieren.
subclass of: E14 Condition Assessment

N20 hat Status
type: ObjectProperty
comment: Diese Eigenschaft erlaubt einem S1_Sammlungsobjekt einen S14_Status zuzuweisen.
domain: S1 Collection Object
range: S14 Status
sub property of: P2 has type
inverse of: N20i ist Status von

D2 hat Zustandsnotiz
type: DatatypeProperty
comment: Diese Eigenschaft dient der Charakterisierung eines E3_Condition_State durch eine nicht formale Beschreibungsangabe.
domain: E3 Condition State
sub property of: P3 has note

N14i wurde praepariert durch
type: ObjectProperty
comment: Diese Eigenschaft bezeichnet eine Pflanze oder ein Fundobjekt, das durch eine S18_Praeparation umgewandelt wurde.
domain: E19 Physical Object
range: S18 Praeparation
sub property of: P124i was transformed by

common
type: Ontology
comment: Changelog see http://objekte-im-netz.fau.de/projekt/node/12
comment: License is same as Erlangen CRM: CC SA-BY 3.0 unported
imports: http://erlangen-crm.org/170309/
version IRI: common-170830a

S46 Grade
type: Class
comment: This class comprises the non-material, intellectual object of the grade that has developed in the historical context. An instance of S46_Grade describes the whole of a class (within a school type) belonging to the same session or to students who have been enrolled in the same year. Example: In Germany grade 1 to 4 are as part of primary school.
comment: Diese Klasse umfasst den nicht-materiellen, gedanklichen Gegenstand der Jahrgangsstufe, der sich im historischen Kontext entwickelt hat. Eine Instanz der Klasse beschreibt die Gesamtheit einer Klasse (innerhalb einer Schulart), die demselben Lernabschnitt zugehoerig sind oder im gleichen Jahr eingeschult wurden. Beispiel: Jahrgangsstufen 1 bis 4 als Teil der Grund- oder Mittelschule.
subclass of: E28 Conceptual Object