S34 Keyword or Tag
type: Class
comment: This class represents keywords and tags used for classification. They are less structured than terms coming from curated thesauri or classification systems. They may be completely unstructured and made up on-the-fly, e.g. by crowd sourcing. Example: "Painting" as a tag with loose / unclear semantics as opposed to the well defined term "paintings" from Getty AAT (300033618)
subclass of: E55 Type

S53 Subcollection
type: Class
comment: Diese Klasse umfasst Teilsammlungen einer uebergeordneten Sammlung, die gemaeß der Klasse E78_Curated_Holding Instanzen der Klasse E18 Materielles, die durch eine oder mehrere Instanzen der Klasse E39 Akteur im Lauf der Zeit für einen bestimmten Zweck und Publikum nach einer ausgewiesenen Sammlungsstrategie zusammengesetzt und aufrechterhalten werden. Eine Instanz der Klasse S53_Teilsammlung kann eine urspruenglich eigenstaendige Sammlung in der Vergangenheit gewesen sein, die in den Sammlungsbestand einer anderen Sammlung integriert wurde. Beispiele: 1. Das Erlanger Herbarium besteht aus mehreren Teilsammlungen z. B. Koch-Herbar, Heller-Herbar oder ER_Nordbayern. 2. Das Deutsche Museum hat die Teilsammlungen Foto+ Film, Haushalt, Maschinen, Medizintechnik, Musikinstrumente und Verkehr.
comment: This class comprises subcollections of a superordinate collection. These are aggregations of instances of E18_Physical_Thing, which are assembled and maintained by one or more instances of E39_Actor over time for a specific purpose and audience, and according to a particular collection development plan. An instance of the class S53_Subcollection may have been an original independent collection in the past that was integrated into the collection of another collection. Example: The Herbarium Erlangense consists of several subcollections, e. g. Koch-Herbar, Heller-Herbar or ER_Nordbayern.
subclass of: E78 Curated Holding

N3 has plain text
type: ObjectProperty
comment: This property describes the identification of an S5_classification_Of_The_ISER_Objects by an E75_Conceptual_Object_Appellation.
domain: S5 Classification Of The ISER Objects
range: E75 Conceptual Object Appellation
sub property of: P149 is identified by
inverse of: N3i is plain text of

S18 Preparation
type: Class
comment: Diese Klasse umfasst Ereignisse, welche die grundsaetzliche Natur eines Objektes veraendert. S18_Praeparation beinhaltet die Erhebung eines Objektes zum Sammlungsobjekt, sei dies durch konservatorische, restauratorische Maßnahmen oder durch das Ereignis der Auswahl durch den Kurator geschehen. Beispiele: 1. Pflanzen oder Pflanzenteile werden nach Trocknung durch Pressen zwischen Filterpapieren auf Papier aufgeklebt 2. Fundobjekt wird von Schmutz und Kalk befreit 3. Aufnahme eines Objektes in den Sammlungsbestand
comment: This class contains events that change the basic nature of an object. S18_Preparation includes the collection of an object as a collection object, either by conservation, restoration measures or the curatorial selection event. Examples: 1. plants or parts of plants are glued to paper after drying by pressing between filter papers 2. discovered object is freed from dirt and lime 3. inclusion of an object in the collection
subclass of: E11 Modification

S65 URL
type: Class
comment: Diese Klasse umfasst die Identifikationsbezeichnung URL (Uniform Resource Locator), um eine Resource im Computernetzwerk zu identifizieren und zu lokalisieren.
comment: This class includes the identifier URL (Uniform Resource Locator) to identify and locate a resource on the computer network.
subclass of: E51 Contact Point

S30 Public Comment
type: Class
comment: This class represents text in human language that comments on things or facts and that is intended to be accessable by the public. The feature of being publicly available is regarded to be independent from the objects or facts the text is about, hence it is modelled as part of the class and not as a subproperty of P67, P129, or the like.
subclass of: E33 Linguistic Object

S24 Geographical Unit
type: Class
comment: This class defines terms that are used to categorize S40 Geographical Places as resembling a certain type of place. No assumptions are made as to how these terms are made up and which rules they follow. Example: - Mountain - City - District - Country - Ocean - Airway
subclass of: E55 Type

N6i entered the collection through
type: ObjectProperty
comment: This property describes an collection object that is transferred to the collection as a permanent loan from an E39_Actor.
domain: S1 Collection Object
range: S9 Permanent Loan
sub property of: P30i custody transferred through

S78 Place Name French
type: Class
comment: Diese Klasse umfasst die franzoesischsprachige Uebersetzung einer Instanz der Klasse E48_Place_Name.
comment: This class contains the French translation of an instance of the class E48_Place_Name. (Note: This class was created for importing data to maintain norm data from an old database into the new.)
subclass of: E44 Place Appellation

N21 has current location
type: ObjectProperty
comment: This property records the permanent location of an instance of S1_Collection_Object at the time of use of this property.
domain: S1 Collection Object
range: E53 Place
sub property of: P54 has current permanent location
inverse of: N21i is current location of

D1 has bundle note
type: DatatypeProperty
comment: Diese Eigenschaft dient der Charakterisierung eines S13_Konvoluts durch eine nicht formale Beschreibungsangabe.
comment: This property is used to characterize an S13_Bundle_Or_Convolute by a non-formal description.
domain: S13 Bundle Or Convolute
sub property of: P3 has note

S21 Image
type: Class
comment: Diese Klasse umfasst Verteilungen von Form, Ton und Farbe, die direkt auf elektronischen Medien gefunden werden können. Eine Instanz von S21_Bild repraesentiert visuell eine andere Klasse wie S1_Sammlungsobjekt. Beispiel: Die digitale Aufnahme (S21_Bild) stellt das Sammlungsobjekt "Tischrechner Olivetti Progamma 101" (S1_Sammlungsobjekt) dar und ist unter der URL XY (S65_URL) zu finden.
comment: Or: S21_Image_Representation
comment: This class includes distributions of form, sound and color that can be found directly on electronic media. An instance of S21_Image represents visually another class such as S1_Sammlungsobjekt. Example: The digital recording (S21_Image) represents the collection object "Tischrechner Olivetti Progamma 101" (S1_Collection_Object) and can be found under the URL XY (S65_URL).
subclass of: E38 Image

S16 Consecutive Number
type: Class
comment: Diese Klasse umfasst Zeichenketten oder Kodierungen, die Instanzen der Klasse S1_Sammlungsobjekt als Eingangsnummer bei der Aufnahme in die Sammlung zugewiesen werden, um sie eindeutig und dauerhaft zu identifizeren.
comment: This class contains character strings that are automatically assigned to the data records of the instances of the Collection Object class as an input number when they are added to the collection database in order to uniquely and permanently identify the objects. This class is to be used if the consecutive number is to be kept as information when data is imported into another system. Or: S16_Sequential_Number
subclass of: E42 Identifier

N31 contains Quadrant ID
type: ObjectProperty
comment: This property describes the connection between an E44_Place_Appellation and a S42_Messtischblatt, which are in a parent-child-relationship. A S42_Messtischblatt contains at least one quadrant, which is identified by an ID.
domain: S42 Messtischblatt
range: E44 Place Appellation
sub property of: P106 is composed of
inverse of: N31i is Quadrant ID of

D2 has status note
type: DatatypeProperty
comment: Diese Eigenschaft dient der Charakterisierung eines E3_Condition_State durch eine nicht formale Beschreibungsangabe.
comment: This property is used to characterize an E3_Condition_State with a non-formal description.
domain: E3 Condition State
sub property of: P3 has note

S52 User group
type: Class
comment: Diese Klasse klassifiziert Personengruppen bzw. Institutionen, welche mit der Sammlung interagieren. Zum Beispiel zur Unterscheidung der Benutzergruppen, die ein Objekt ausleihen koennen. Die Klasse S52_Benutzergruppe ist eine Subklasse von E55_Type. Beispiel: Studenten, Museen, Dozenten
comment: This class identifies groups of people or institutions that interact with the collection. The class can be used to differentiate between user groups that can borrow an object. Example: Students, museums, lecturers
subclass of: E55 Type

N34 contains geographical latitude
type: ObjectProperty
comment: This property describes the connection between an E44_Place_Appellation and S41_Geographical_Coordinates, which are in a parent-child-relationship. A S41_Geographical_Coordinates contains a geographical latitude.
domain: S41 Geographical Coordinates
range: E44 Place Appellation
sub property of: P106 is composed of
inverse of: N34i is geographical latitude of

N18i transferred object by
type: ObjectProperty
comment: This property describes an E39_Actor that assigns its legal ownership to the collection by an event S8_Acquisition.
domain: E39 Actor
range: S8 Acquisition
sub property of: P23i surrendered title through

S40 Geographical Place
type: Class
comment: This class comprises structuring geographical elements. (esp. on earth's habitable surface) Geographical Places typically can be referred to by proper place names and categorized by S24_Geographical_Unit. This class comprises man made and natural geographic features, like dwellings, counties, water ways, mountain (ranges), etc. Geographical places may be 3-dimensional and extend into space or earthen ground. (e.g. caves) Examples: - Paris (just the geography, not the physical entity or administrative body! It may, however, be categorized as greographical unit "dwelling" or "city") - The Alps - Tethys
subclass of: E53 Place

N30 contains sea level
type: ObjectProperty
comment: This property describes the connection of an E44_Place_Appellation with a S41_geographical_coordinates, which are in a parent-child- relationship. S41_geographical_coordinates contains the indication of a sea level.
domain: S41 Geographical Coordinates
range: E44 Place Appellation
sub property of: P106 is composed of
inverse of: N30i is sea level of

S58 Type Of Function Status
type: Class
comment: Diese Klasse umfasst das Wesen eines Zustands, in dem sich ein materieller Gegenstand befindet. Eine Instanz der Klasse beschreibt speziell die Funktionstuechtigkeit eines Objektes.
comment: This class comprises the essence of a state in which there is a material object. An instance of the class describes the functionality of an object.
subclass of: S2 Type Of Conservation Status

S60 Restoration Measure
type: Class
comment: Diese Klasse umfasst Instanzen expliziter und absichtlicher Handlung, um eine Instanz der Klasse S1_Sammlungsobjekt restauratorisch zu bearbeiten.
comment: This class contains instances of explicit and intentional action to restore an instance of the class S1_Sammlungsobjekt.
subclass of: E11 Modification

S84 Type UFG
type: Class
comment: Diese Klasse umfasst Konzepte, um Instanzen der Klasse S1_Sammlungsobjekt unter Verwendung von Begriffen aus fachspezifischen Vokabular der Ur- und Fruehgeschichtlichen Sammlung zu charakterisieren und zu klassifizieren.
comment: This class contains concepts for characterizing and classifying instances of the class S1_Collection_Object using terms from subject-specific vocabulary of the prehistoric and early historical collection. Or: S84_Type
subclass of: E55 Type

S31 Email Address
type: Class
comment: Diese Klasse umfasst identifizierende Kennzeichen in Form von Email Adressen, die benutzt werden, um mit Instanzen der Klasse E39_Actor zu kommunizieren. Beispiel: mustermann
comment: This class contains identifying indicators in the form of email addresses that are used to communicate with instances of class E39_Actor. Example: mustermann(at)gmail.com
subclass of: E51 Contact Point

N32 contains Messtischblatt
type: ObjectProperty
comment: This property describes the connection between an E44_Place_Appellation and a S42_Messtischblatt, which are in a parent-child-relationship.
domain: S42 Messtischblatt
range: E44 Place Appellation
sub property of: P106 is composed of
inverse of: N32i is Messtischblatt of

S77 Place Name German
type: Class
comment: Diese Klasse umfasst die deutschsprachige Uebersetzung einer Instanz der Klasse E48_Place_Name.
comment: This class contains the German translation of an instance of the class E48_Place_Name. (Note: This class was created for importing data to maintain norm data from an old database into the new.)
subclass of: E44 Place Appellation

N8i donated
type: ObjectProperty
comment: This property describes an E39_Actor that donated an object through an event S8_Acquisition.
domain: E39 Actor
range: S8 Acquisition
sub property of: P15i influenced

S79 Place Name English
type: Class
comment: Diese Klasse umfasst die englischsprachige Uebersetzung einer Instanz der Klasse E48_Place_Name.
comment: This class contains the English translation of an instance of the class E48_Place_Name. (Note: This class was created for importing data to maintain norm data from an old database into the new.)
subclass of: E44 Place Appellation

P81b has earliest end
type: DatatypeProperty
comment: This property decribes the earliest possible end time of an instance of E52_Time-Span.
domain: E52 Time-Span

N23i was collected by
type: ObjectProperty
comment: This property describes the use of a discovered object or plant that is needed to perform a collection process.
domain: E19 Physical Object
range: S20 Collection Process
sub property of: P16i was used for

N28 Zeitspanne beginnt
type: ObjectProperty
comment: Diese Eigenschaft legt den Startpunkt einer Zeitspanne fest. die sich in einer anderen Zeitspanne mit einer laengeren Dauer befindet. (eventuell zu loeschen)
domain: E2 Temporal Entity
range: E2 Temporal Entity
sub property of: P116 starts
inverse of: N28i Zeitspanne wurde begonnen mit

S63 Type Of Sale
type: Class
comment: Diese Klasse klassifiziert alle Arten von Besitzabgabe, um eine Instanz der Klasse S1_Sammlungsobjekt durch eine Instanz der Klasse S64_Abgabe_Verkauf aus der Sammlung zu entfernen. Beispiel: 1. Verkauf 2. Entsorgung 3. Abgabe
comment: This class classifies all types of collection levy to remove an instance of the class S1_Collection_Object from the collection by an instance of the class S64_Sale. Example: sale, disposal, delivery
subclass of: E55 Type

N16i has been taken out of the collection by
type: ObjectProperty
comment: This property describes a collection object that was taken from the collection due to an instance of the class S9_Permanent_Loan.
domain: S1 Collection Object
range: S9 Permanent Loan
sub property of: P30i custody transferred through

S20 Collection Process
type: Class
comment: Diese Klasse umfasst Instanzen einer absichtlichen Handlung, die zum Aufsammeln (inklusive Transport) einer Instanz der Klassen S19_Pflanze oder S83_Fundobjekt durch eine Instanz der Klasse E39_Actor ausgefuehrt wurde. Beispiel: 1. Bauer sammelt antike Scherbe nach Pfluegen seines Ackers auf. 2. Sammler Max Mustermann pflueckt eine Pflanze und bringt sie dem Herbarium Erlangense. 3. Fundobjekt einer Ausgrabung einsammeln.
comment: This class contains instances of an intentional action executed by an instance of the class E39_Actor to collect (including transport) an instance of the classes S19_Plant or S83_Discovered_Object. Example: 1. peasant collects antique shards after ploughs of his field. 2. collector Max Mustermann plucks a plant and brings it to the Herbarium Erlangense. 3. Discovered Object of an archaeological excavation.
subclass of: E7 Activity

S42 Messtischblatt
type: Class
comment: Die Klasse umfasst die textuelle oder numerische Information, die in Deutschland unter der Bezeichnung Messtischblatt gelaeufig ist. Eine Instanz der Klasse S42_Messtischblatt ist eine amtliche topografische Karte im Massstab 1:25.000 (TK 25), mit der eine bestimmte Instanz der Klasse E53_Place innerhalb raeumlicher Schemata lokalisiert werden kann. Beispiel: Das Gebiet Erlangen-Nord ist auf dem Messtischblatt Nr. 6332 zu finden.
comment: The class comprises the textual or numerical information which is common in Germany under the designation "Messtischblatt". An instance of the class S42_Messtischblatt is an official topographical map on a scale of 1:25,000 (TK 25), with which a certain instance of the class E53_Place can be located within spatial schemes. Example: The Erlangen-Nord area can be found on the Messtischblatt No. 6332.
subclass of: E47 Spatial Coordinates

S33 Annotation
type: Class
comment: Diese Klasse umfasst Texte oder Stichpunkte in einer oder mehrerer natuerlicher Sprachen. Eine Instanz dieser Klasse liefert vertiefende oder erlaeuternde Informationen zu einem Objektdatensatz.
comment: This class represents text or keywords in natural languange that comments on things or objects. An instance of this class provides more detailed information of the facts or serves to provide a better understanding of the object.
subclass of: E33 Linguistic Object

N24 contains surname
type: ObjectProperty
comment: This property describes the connection of an E82_Actor_Appellation with another E82_Actor_Appellation, which are in a parent-child-relationship. The full name of a person contains at least one surname.
domain: E82 Actor Appellation
range: E82 Actor Appellation
sub property of: P106 is composed of
inverse of: N24i is surname of

S11 Weight
type: Class
comment: Diese Klasse umfasst quantifizierbare Eigenschaften eines Objektes. Eine Instanz der Klasse S11_Gewicht beschreibt das durch geeichte Groessen gemessene und durch Werte annaehrend ausgedrueckte Gewichtsmass eines Objekts. Beispiel: Das Notebook NEC MultiSpeed hat ein Gewicht von 5 kg.
comment: This class contains quantifiable properties of an object. An instance of the class S11_Weight describes the weight of an object measured by calibrated values or approximately expressed by values. Example: The Notebook NEC MultiSpeed has a weight of 5 kg.
subclass of: E54 Dimension

S7 Condition Assessment
type: Class
comment: Diese Klasse umfasst die Feststellung des Zustands eines Objekts waehrend einer bestimmten Zeitspanne, um die Umstaende der jeweiligen Erhebung qualitativ zu beurteilen und zu dokumentieren.
comment: This class includes the assessment of the condition of an object during a given period of time in order to assess and document qualitatively the circumstances of the survey in question.
subclass of: E14 Condition Assessment

N12i consists of
type: ObjectProperty
comment: This property connects several S1_Collection_Objects to one S13_Bundle_Or_Convolute.
domain: S13 Bundle Or Convolute
range: S1 Collection Object
sub property of: P103i was intention of

S50 Authenticity
type: Class
comment: Diese Klasse umfasst die "Echtheit" von Objekten. Sie unterscheidet, ob eine Instanz einer Klasse ein Original oder eine Kopie ist. Beispiel: Zeugnis von Max Mustermann ist im Original in der Schulgeschichtlichen Sammlung vorhanden.
comment: This class comprises keywords or terms used to describe the authenticity of an object. It distinguishes between whether an instance of a class is an original, a print or a copy. Example: The original of Max Mustermann's report is available in the school history collection.
subclass of: E55 Type

S12 LxWxH
type: Class
comment: Diese Klasse umfasst quantifizierbare Eigenschaften eines Objektes. Eine Instanz der Klasse S12_LxBxH bildet das durch geeichte Groessen und durch Werte annaehrend ausgedrueckte Laengenmass eines Objektes ab. Diese Klasse beschraenkt sich dabei nicht auf das spezielle Format Laenge x Breite x Hohe. Beispiel: Die Salaminische Rechentafel hat die Masse 149 x 75 x 4,5 cm.
comment: This class contains quantifiable properties of an object. An instance of the class S12_LxWxH represents the approximate length of an object, expressed in calibrated sizes and values. This class is not limited to the special format length x width x height. Example: The size of the tablet is 149 x 75 x 4,5 cm.
subclass of: E54 Dimension

P81a has latest start
type: DatatypeProperty
comment: This property decribes the latest possible start time of an instance of E52_Time-Span.
domain: E52 Time-Span

N15 resulted in preparation
type: ObjectProperty
comment: This property describes an S1_Collection_Object that represents the result of an S18_Preparation.
domain: S18 Preparation
range: S1 Collection Object
sub property of: P123 resulted in
inverse of: N15i preparation resulted from

S29 Private Comment
type: Class
comment: This class represents text in human language that comments on objects of facts and that is intended to be disclosed only to a limited group of people. The feature of being private is regarded to be independent from the objects or facts the text is about, hence the privacy is modelled as part of the class and not as a subproperty of P67, P129, or the like.
subclass of: E33 Linguistic Object

S27 Insurance Value
type: Class
comment: Diese Klasse umfasst quantifizierbare Eigenschaften eines Objektes. Eine Instanz der Klasse S27_Versicherungswert umfasst den durch Werte annaehrend ausgedrueckten Betrag, den der Versicherungsnehmer zur Zeit des Eintrittes des Versicherungsfalles fuer die Wiederbeschaffung oder Wiederherstellung der versicherten Sache aufzuwenden hat.
comment: This class contains quantifiable properties of an object. An instance of class S27_Insurance_Value comprises the amount approximately expressed by values, which the policyholder has to spend for the replacement or restoration of the insured object.
subclass of: E54 Dimension

S8 Acquisition
type: Class
comment: Diese Klasse umfasst Instanzen gesetzlich geregelten Erwerbs von Besitz, die von Instanzen der Klasse E39_Akteur ausgefuehrt werden. Eine Instanz der Klasse S8_Erwerb beschreibt insbesondere den Beginn eines Besitzverhaeltnisses durch Ankauf oder Erwerb (S10_Zugangsart_oder_Erwerbsart) eines Sammlungsobjekts.
comment: This class includes instances of legal acquisitions of property executed by instances of class E39_Actor. An instance of class S8_Acquisition describes in particular the beginning of an ownership relationship by purchase or acquisition (S10_Type_Of_Access_Or_Purchase) of a collection object.
subclass of: E8 Acquisition

S28 Form Of Publication
type: Class
comment: Diese Klasse stellt Konzepte dar, deren kontrolliertes Vokabular sich auf die Erscheinungsform einer Instanz der Klasse S1_Sammlungsobjekt bezieht, um Sammlungsobjekte zu verschlagworten. Diese Klasse wurde zum Beispiel innerhalb der Schulgeschichtlichen Sammlung verwendet, um Sammlungsobjekte, die in Papierform vorhanden sind, zu klassifizieren. Beispiele: 1. Heft 2. Handschrift Schueler/Schuelerin 3. Postkarte 4. Einzelblatt/Einzelblaetter 5. Foto
comment: This class represents concepts whose controlled vocabulary refers to the appearance of an instance of the class S1_Sammlungsobjekt to index collection objects. (This class was used, for example, within the School History Collection (Schulgeschichtliche Sammlung) to classify objects that are available in paper form.) Examples: booklet, manuscript student, postcard, single sheet, photo
subclass of: E55 Type

S10 Type Of Access Or Purchase
type: Class
comment: Diese Klasse klassifiziert alle Arten von Besitzerwerb, um eine Instanz der Klasse S1_Sammlungsobjekt durch eine Instanz der Klasse S8_Erwerb in die Sammlung aufzunehmen. Beispiel: 1. Schenkung 2. Ankauf 3. Stiftung
comment: This class classifies all types of acquisition of ownership to include an instance of class S1_Sammlungsobjekt in the collection by an instance of class S8_Acquisition. Example: donation, purchase, foundation
subclass of: E55 Type

S5 Classification Of The ISER Objects
type: Class
comment: Diese Klasse umfasst alle Instanzen der zugrunde liegenden Systhematik der Informatiksammlung zur Klassifizierung und hierarchischen Einordnung der Sammlungsobjekte in den Bestand. Die Systhematik der Informatiksammlung gliedert sich in einen codierten Identifier (z. B. 1.1.5) und in Klartext (z. B. Elektromechanische Rechenmaschinen). Beispiel: 1 Hardware: Rechengeraete und Bauteile 1.1 Rechenhilfsmittel und -maschinen 1.1.5 Elektromechanische Rechenmaschinen 1.1.5.1 Addiermaschinen 1.1.5.2 Staffelwalzen 1.1.5.3 Sprossenrad 1.1.5.4 Sonstige
comment: This class comprises all instances of the underlying system of a Collection for classification and hierarchical classification of the collection objects in the collection. The subject matter of e.g. the computer science collection is divided into a coded identifier (e. g. 1.1.5) and plain text (e. g. electromechanical calculators). Example: 1 Hardware: Calculators and components 1.1 Calculation aids and machines 1.1.5 Electromechanical calculators 1.1.5.1 Adding machines 1.1.5.2 Scaled rollers 1.1.5.3 Stepped wheel 1.1.5.4 Other
subclass of: E55 Type

S68 Authority File
type: Class
comment: Diese Klasse umfasst Dokumente, die eine Terminologie oder ein konzeptuelles System zur konsistenten Verwendung definieren.
comment: This class contains documents that define a terminology or conceptual system for consistent use.
subclass of: E32 Authority Document

N42 has duplicate
type: ObjectProperty
comment: This property describes the relationship between a first entity and a second entity, which is a duplicate of the first entity.
domain: E1 CRM Entity
range: E1 CRM Entity

P82b has latest end
type: DatatypeProperty
comment: This property decribes the latest possible end time of an instance of E52_Time-Span.
domain: E52 Time-Span

S71 Editing
type: Class
comment: Die Klasse umfasst die Aktionen der Dokumentation, Zeitpunkt der Vergabe einer Inventarnummer oder die Erarbeitung eines Zustandsprotokolls zu einem Objekt durch den Kurator oder einen Sammlungsmitarbeiter. Beispiel: Eingabe eines Objektdatensatzes in die Datenbank der Sammlung durch Mitarbeiter XY.
comment: The class comprises the actions of the documentation, the time when an inventory number is allocated or the curator or a member of the collection staff creates a status report for an object. Example: Entering an object data record in the collection database by employee XY.
subclass of: E13 Attribute Assignment

N14i was prepared by
type: ObjectProperty
comment: This property refers to a plant or discovered object that has been transformed by an S18_Preparation.
domain: E19 Physical Object
range: S18 Preparation
sub property of: P124i was transformed by

common
type: Ontology
comment: License is same as Erlangen CRM: CC SA-BY 3.0 unported
comment: Changelog see http://objekte-im-netz.fau.de/projekt/node/12
imports: http://erlangen-crm.org/170309/
version IRI: common-170830a

S56 Usage Type
type: Class
comment: Diese Klasse umfasst alle Arten von Nutzungsmöglichkeiten und Verwendungszwecke einer Instanz der Klasse S1_Sammlungsobjekt. Beispiele: 1. Der Rechner "COMMODORE PET Series 2001" wird ausgestellt (S56_Nutzungstyp) im 1.OG im Treppenhaus des RRZE. 2. Das Sammlungsobjekt Suanpan (Abakus) wird im Moment für museumspädagogische Zwecke (S56_Nutzungstyp) benutzt.
comment: This class comprises all types of usage possibilities of an instance of class S1_Sammlungsobjekt. Examples: The computer "COMMODORE PET Series 2001" will be exhibited (S56_Usage_Type) on the 1st floor in the staircase of the RRZE. The Suanpan (Abakus) collection object is currently being used for museum educational purposes (S56_Usage_Type).
subclass of: E55 Type

S37 Designation
type: Class
comment: Diese Klasse umfasst Zeichenketten, die zur Identifizierung einer konkreten Instanz der Klasse S1_Sammlungsobjekt benutzt werden und die aktuelle Bezeichnung im Forschungs- und Sammlungskontext wiedergibt.
comment: This class contains strings that are used to identify a specific instance of the class S1_Collection_Object and represents the current name in the research and collection context.
subclass of: E42 Identifier

S82 Hierarchie
type: Class
comment: eventuell zu loeschen (n. b.)
subclass of: E41 Appellation

S41 Geographical Coordinates
type: Class
comment: Diese Klasse umfasst die numerische Information, mit der eine bestimmte Instanz der Klasse E53_Place innerhalb raeumlicher Schemata lokalisiert werden kann. Eine Instanz der Klasse S41_geographische_Koordinaten beschreibt die Lage eines Punktes auf der Erde in Form von Kugelkoordinaten bzw. GPS-Koordinaten. Beispiel: Die Stadt Nuernberg hat die Koordinaten 49° 27′ N , 11° 5′ O.
comment: This class contains the numeric information with which a particular instance of the class E53_Place can be located within spatial schemata. An instance of class S41_Geographical_Coordinates describes the position of a point on earth in the form of spherical coordinates or GPS coordinates. Example: The city of Nuremberg has the coordinates 49° 27' N, 11° 5' O.
subclass of: E47 Spatial Coordinates

S39 Location
type: Class
comment: A location is a place that is used to locate things on a sub-geographical level. Other than geographical places they may not have a place name but are described / circumscribed. A location may be specified by spatial coordinates, though. For geographical reference, a location can be linked to the / a geographical place that it is in. Example: - An specific individual plant was found "under the first oak tree to the left of the main gate". - An object's location is on shelf "XII-3". - An object was found "in the remnants of building X". (where building X could be the surrounding geographical place.
subclass of: E53 Place

N33 contains geographical longitude
type: ObjectProperty
comment: This property describes the connection between an E44_Place_Appellation and S41_Geographical_Coordinates, which are in a parent-child-relationship. A S41_Geographical_Coordinates contains a geographical longitude.
domain: S41 Geographical Coordinates
range: E44 Place Appellation
sub property of: P106 is composed of
inverse of: N33i is geographical longitude of

S3 Inventory Number
type: Class
comment: Diese Klasse umfasst Zeichenketten oder Kodierungen, die Instanzen der Klasse S1_Sammlungsobjekt zugewiesen werden, um sie eindeutig und dauerhaft innerhalb des Sammlungskontexts zu identifizieren. Beispiele: 1. 7.5.16/102 2. I1053
comment: This class contains strings or encodings that are assigned to instances of class S1_Collection_Object to identify them uniquely and permanently within the collection context. Examples: 1. 7.5.16/102 2. I1053, K0004
subclass of: E42 Identifier

S26 School
type: Class
comment: Die Klasse umfasst Institutionen, die nach einem oeffentlichen Bildungsauftag handeln, um Wissen und Koennen durch Lehrer an Schueler zu vermitteln.
comment: The class includes institutions that act according to a public educational task in order to impart knowledge and skills from teachers to students.
subclass of: E40 Legal Body

S36 Zeitspanne Ende
type: Class
comment: (eventuell zu loeschen)
comment: Diese Klasse umfasst Datumsangaben. Eine Instanz der Klasse gibt das moeglichst exakte Ende einer Instanz der Klasse E52_Time-Span wieder. Instanzen von S36_Zeitspanne_Ende enthalten keine Praepositionen bzw. weiche Datierungsparameter, sondern nur konkrete Datumsangaben. Um ungefaehre Zeitangaben zu beschreiben sollte die Klasse E52_Time_Span genutzt werden. Beispiel: Der Produktion des Mikroprozessors WinChip C6 wurde 1999 beendet.
subclass of: E50 Date

S57 Comment On Provenance
type: Class
comment: Diese Klasse umfasst Texte oder Stichpunkte in einer oder mehrerer natuerlicher Sprachen. Eine Instanz dieser Klasse dient dem naeheren Verstaendnis einer Instanz der Klasse S1_Sammlungsobjekt und liefert vertiefende oder erlaeuternde Informationen zur Geschichte dieses Objektes.
comment: This class represents text in natural languange that comments on the provenance of an object or provides an anecdote about the object. Or: S57_Object_Provenance, S57_Provenance
subclass of: E33 Linguistic Object

S86 Organisation
type: Class
comment: This class contains social structures that include several people, such as an institution or an association that share a collective goal and distinguish themselves from their environment.
subclass of: E40 Legal Body

N11 is represented visually on
type: ObjectProperty
comment: This property establishes a relationship between S21_image and an S1_Collection object, which it represents visually.
domain: S1 Collection Object
range: S21 Image
sub property of: P138i has representation
inverse of: N11i represents

S4 Encodings Or Decimal Structures
type: Class
comment: Diese Klasse umfasst die Kodierung, die den Instanzen einer Klasse zugewiesen werden, um sie eindeutig und dauerhaft im Kontext der Sammlung zu identifizieren. Beispiel: 1. Instanzen der Klasse S5_Klassifikation_Informatik wurde neben einer Klartextsysthematik eine Kodierung zugewiesen, um sie eindeutig zu identifizieren. 1 1.1 1.1.5 2. Laendercode: DE, EN
comment: This class contains encodings or decimal structures that are assigned to the instances of a class to uniquely and permanently identify them in the context of the collection. Example: 1. Instances of class S5_classificaction_Of_The_ISER_Objects have been assigned an encoding in addition to a clear text topic to uniquely identify them. 1 1.1 1.1.5 2. ISO 3166-1 (codes for the names of countries, dependent territories, and special areas of geographical interest.): DE, EN
subclass of: E42 Identifier

N19 has type of purchase
type: ObjectProperty
comment: This property is intended to classify an instance of S8_Acquisition using S10_Type_Of_Access_Or_Purchase.
domain: S8 Acquisition
range: S10 Type Of Access Or Purchase
sub property of: P2 has type
inverse of: N19i is type of purchase of

S55 Former Idientifier
type: Class
comment: Diese Klasse umfasst Zeichenketten oder Kodierungen, die den Instanzen der Klasse S1_Sammlungsobjekt zur einzigartigen Identifizierung in der Vergangenheit zugewiesen wurden. Dieser Identifier ist jedoch im aktuellen Kontext der Sammlung veraltet oder unbrauchbar und durch eine andere Instanz der Klasse E42_Identifier bzw. deren Subklassen eindeutig und dauerhaft ersetzt worden. Beispiel: 1. Bei der Umstrukturierung der eigenen Sammlung veraltete Inventarnummern beibehalten. 2. Aufgrund der Aufloesung und Integration einer anderen Sammlung in den eigenen Bestand werden die ehemaligen Inventarnummern dokumentarisch festgehalten.
comment: This class contains strings or encodings that have been assigned to instances of the class S1_Collection_Object for unique identification in the past. However, this identifier is outdated or unusable in the current context of the collection and has been replaced uniquely and permanently by another instance of the class E42_Identifier or its subclasses. Example: Due to the dissolution and integration of another collection into the own collection, the former inventory numbers are documented.
subclass of: E42 Identifier

N45 falls within calculated
type: ObjectProperty
comment: This property describes instances of E53_Place whose areas fall into the area of another location and must be calculated from reference data.
sub property of: P89 falls within
inverse of: N45i contains calculated

N4 assigned
type: ObjectProperty
comment: This property describes the S6_Conservation_State observed during a S7_Condition_Assessment.
domain: S7 Condition Assessment
range: S6 Conservation Status
sub property of: P35 has identified
inverse of: N4i was assigned by

N10 falls within
type: ObjectProperty
comment: This property specifies instances of E53_Place whose areas fall into the territory of another location.
domain: E53 Place
range: E53 Place
sub property of: P89 falls within
inverse of: N10i contains

S14 Status
type: Class
comment: Diese Klasse umfasst den aktuellen Status eines Sammlungsobjektes im verwaltungstechnischen Sinn. S14_Status ist eine Subklasse von E55_Type. Beispiel: 1. Das Gemaelde "Mona Lisa" ist nicht ausleihbar. 2. "Fuenf tanzende Frauen" von Edgar Degas hat den Status verschollen.
comment: This class comprises the current status of an object in an administrative meaning. Example: The painting "Mona Lisa" is not available for loan. Second "Five Dancing Women" by Edgar Degas is missing. (or: S14_Administrative_Status)
subclass of: E55 Type

N17i lent object on
type: ObjectProperty
comment: Or: borrowed_object_by
comment: This property specifies an E39_Actor that makes an object available to the collection by means of an event S9_Permanent_Loan.
domain: E39 Actor
range: S9 Permanent Loan
sub property of: P28i surrendered custody through

N25 contains firstname
type: ObjectProperty
comment: This property describes the connection of an E82_Actor_Appellation with another E82_Actor_Appellation, which are in a parent-child-relationship. The full name of a person contains at least one first name.
domain: E82 Actor Appellation
range: E82 Actor Appellation
sub property of: P106 is composed of
inverse of: N25i is firstname of

N40 has URL
type: ObjectProperty
comment: This property describes the identification of an E73_Information_Object by a S65_URL.
domain: E73 Information Object
range: S65 URL
sub property of: P1 is identified by
inverse of: N40i url belongs to

S35 Zeitspanne Start
type: Class
comment: (eventuell zu loeschen)
comment: Diese Klasse umfasst Datumsangaben. Eine Instanz der Klasse gibt den moeglichst exakten Start einer Instanz der Klasse E52_Time-Span wieder. Instanzen von S35_Zeitspanne_Start enthalten keine Praepositionen bzw. weiche Datierungsparameter, sondern nur konkrete Datumsangaben. Um ungefaehre Zeitangaben zu beschreiben sollte die Klasse E52_Time_Span genutzt werden. Beispiel: Der Produktion des Mikroprozessors WinChip C6 wurde 1997 begonnen.
subclass of: E50 Date

S59 Restoration Type
type: Class
comment: Diese Klasse umfasst alle Arten von Restaurierungstechniken und -technologien, um eine Instanz der Klasse S1_Sammlungsobjekt bzw. ein Teil der Instanz durch eine Instanz der Klasse S60_Restaurierungsmassnahme zu restaurieren.
comment: This class comprises all types of restoration techniques and technologies to restore an instance of the class S1_Sammlungsobjekt or part of the instance by an instance of the class S60_Restoration_Measure.
subclass of: E55 Type

S72 Old ID
type: Class
comment: Diese Klasse bezieht sich auf die eindeutige (automatisch) vergebene ID innerhalb der Datenbank, nicht auf einen ehemaligen Identifier kuratorischen Ursprungs. Fuer einen veralteten Identifier durch die Sammlung bzw. deren Kurator existiert die Klasse S55_ehemaliger Identifier.
comment: This class refers to the unique (automatically) assigned ID within the database, not to a former identifier of curatorial origin. Class S55_Former_Identifier exists for an obsolete identifier by the collection or its curator.
subclass of: E42 Identifier

N13 has collector
type: ObjectProperty
comment: This property specifies an S20_Collection_Process that is performed by an E21_Person.
domain: S20 Collection Process
range: E21 Person
sub property of: P14 carried out by
inverse of: N13i collected

N20 has status
type: ObjectProperty
comment: This property allows an S1_Collection_Object to be assigned an S14_Status.
domain: S1 Collection Object
range: S14 Status
sub property of: P2 has type
inverse of: N20i is status of

S9 Permanent Loan
type: Class
comment: Die Klasse umfasst unentgeltliche Uebergaben von zum Gebrauch ueberlassene Gegenstaenden zwischen zwei Instanzen der Klasse E39_Actor. Eine Instanz der Klasse S9_Dauerleihgabe beschreibt die durch einen Vertrag geregelte unbefristete Leihe im musealen Kontext. Beispiel: "Der Turmbau zu Babel" von Roelant Savery im Germanischen Nationalmuseum ist eine Dauerleihgabe der Museen der Stadt Nuernberg.
comment: The class includes free transfers of objects made available for use between two instances of class E39_Actor. An instance of class S9_Permanent_Loan describes the unlimited loan regulated by a contract in the museum context. Example: "The Tower of Babel" by Roelant Savery in the Germanisches Nationalmuseum is on permanent loan from the museums of the city of Nuremberg.
subclass of: E10 Transfer of Custody

S54 Comment
type: Class
comment: Diese Klasse umfasst Texte oder Stichpunkte in einer oder mehrerer natuerlicher Sprachen. Eine Instanz dieser Klasse dient dem naeheren Verstaendnis eines Sachverhalts und liefert vertiefende oder erlaeuternde Informationen.
comment: This class represents text or keywords in natural languange that comments, explains or criticizes on facts or on the meaning of a writing.
subclass of: E33 Linguistic Object

S6 Conservation Status
type: Class
comment: Diese Klasse umfasst den Erhaltungszustand von Objekten in einem bestimmten Zeitraum. Eine Instanz dieser Klasse beschreibt die physische Beschaffenheit eines materiellen Gegenstands waehrend eines bestimmten Zeitraums E52_Time-Span. Das Wesen des entsprechenden Zustands kann durch die Klasse S2_Erhaltungszustandstyp charakterisiert werden. Beispiel: Die Zustand der Fotografie "Klassenfoto einer Maedchenklasse" am 17.2.2017 um 15 Uhr P2_hat_den_Typus leicht beschaedigt (S2_Erhaltungszustandstyp).
subclass of: E3 Condition State

N44i is calculated coordinates of
type: ObjectProperty
comment: This property describes instances of E53_Place whose coordinates are calculated from reference data.
sub property of: P87i identifies

D4 has location hierarchy
type: DatatypeProperty
comment: Diese Eigenschaft dient der Charakterisierung eines S40_geographischen_Orts durch eine nicht formale Beschreibungsangabe.
comment: This property is used to characterize an S40_Geographical_Place by a non-formal description.
domain: S40 Geographical Place
sub property of: P3 has note

N35 is composed of
type: ObjectProperty
comment: This property allows you to analyze instances of class E78_Curated_Holding in their components. This property is mainly intended for the documentation of an instance of the class S53_Subcollection and the corresponding S1_Collection_Object.
domain: E78 Curated Holding
range: E22 Man-Made Object
sub property of: P46 is composed of
inverse of: N35i forms part of

N26 describes the content of
type: ObjectProperty
comment: This property describes an S1_Collection_Object as the theme of an E33_Linguistic_Object to describe its content.
domain: E33 Linguistic Object
range: S1 Collection Object
sub property of: P129 is about
inverse of: N26i is described content in

S62 Estimated Value
type: Class
comment: Diese Klasse umfasst quantifizierbare Eigenschaften eines Objektes. Eine Instanz der Klasse S62_Schaetzwert bildet den durch fachspezifische Kriterien ermittlerte und durch Werte annaehrend ausgedrueckte vermutete Betrag eines Objektes ab.
comment: This class contains quantifiable properties of an object. An instance of class S62_Estimated_Value represents the assumed amount of an object determined by specific criteria and expressed as approximate values.
subclass of: E54 Dimension

S2 Type Of Conservation Status
type: Class
comment: Diese Klasse umfasst das Wesen eines Zustands, in dem sich ein materieller Gegenstand befindet. Instanzen der Klasse charakterisieren den Erhaltungszustands einer Instanz der Klasse S1_Sammlungsobjekt im Moment bzw. in einer bestimmten Zeitspanne. Beispiele: 1. leicht/ stark beschaedigt 2. voll funktionsfaehig 3. defekt 4. guter Zustand
comment: This class comprises the essence of a state in which a material object is to be found. Instances of the class characterize the state of preservation of an instance of the class S1_Collection_Object at the moment or within a certain period of time. Examples: 1. lightly/ severely damaged 2. fully functional 3. defective 4. good condition
subclass of: E55 Type

N29 Zeitspanne endet
type: ObjectProperty
comment: Diese Eigenschaft legt den Endpunkt einer Zeitspanne fest. die sich in einer anderen Zeitspanne mit einer laengeren Dauer befindet. (eventuell zu loeschen)
domain: E2 Temporal Entity
range: E2 Temporal Entity
sub property of: P115 finishes
inverse of: N29i Zeitspanne wurde beendet mit

N2 has coding
type: ObjectProperty
comment: This property records the preferred S4_Encodings_Or_Decimal_Structures that was used at the time this property was used to identify an instance of the class E55_Type or its subclasses in the context of the collection.
domain: S5 Classification Of The ISER Objects
range: S4 Encodings Or Decimal Structures
sub property of: P48 has preferred identifier
inverse of: N2i is code of

S25 Name Abbreviation
type: Class
comment: Diese Klasse umfasst Zeichenketten, die den Instanzen der Klasse E39_Actor zugewiesen werden, um sie zusaetzlich ueber eine Abkuerzung von einer Silbe oder einem bzw. mehreren Woertern identifizieren zu koennen. Beispiel: Das Autorenkuerzel L. im Herbarium Erlangense steht fuer Linné.
comment: This class contains character strings that are assigned to the instances of the class E39_Actor in order to be able to identify them additionally by abbreviation of one or more syllable. Example: The author abbreviation L. in the Erlangense Herbarium stands for Linné.
subclass of: E42 Identifier

S61 Acquisition Price
type: Class
comment: Diese Klasse umfasst quantifizierbare Eigenschaften eines Objektes. Eine Instanz der Klasse S61_Ankaufspreis beschreibt den durch fachspezifische Kriterien ermittelte und durch Werte annaehrend ausgedrueckte Kaufpreis, der fuer ein Objekt zur Anschaffung aufgebracht werden musste.
comment: This class contains quantifiable properties of an object. An instance of the class S61_Acquisition_Price describes the acquisition price determined by specific criteria and expressed by values, which had to be paid for an object.
subclass of: E54 Dimension

S66 Person Or Institution
type: Class
comment: Diese Klasse umfasst alle Arten von Personen und Institutionen, die als Akteuere fuer die Sammlung relevant sind. Eine Instanz der Klasse S66_Person_Institution beschreibt einen Akteur, der eine Rolle als Stifter, Hersteller, Autor oder aehnliches einnimmt oder als Teil einer Instanz von S73_Information_Object auf einem Sammlungsobjekt erwaehnt wird. Beispiel: Im Naturkundeheft des Schuelers Max Mustermann (S66_Person_Institution) wird der Lehrer Laempel (S66_Person_Institution) auf Seite 12 erwaehnt. Das Heft gelang als Schenkung der Antiquariats XY (S66_Person_Institution) in den Bestand der Sammlung.
comment: This class includes all types of persons and institutions that are relevant to the collection as acting persons. An instance of class S66_Person_Or_Institution describes an actor who has a role as founder, manufacturer, author, or similar, or is mentioned as part of an instance of S73_Information_Object on a collection object. Example: The natural history booklet of the student Max Mustermann (S66_Person_Or_Institution) mentions the teacher Laempel (S66_Person_Or_Institution) on page 12.
subclass of: E39 Actor

N7 is classified as
type: ObjectProperty
comment: This property allows the classification of an S1_Collection_Objects into the hierarchically structured S5_classification_Of_The_ISER_Objects.
domain: S1 Collection Object
range: S5 Classification Of The ISER Objects
sub property of: P2 has type
inverse of: N7i classified

N5i was acquired by
type: ObjectProperty
comment: This property describes a S1_Collection_Object that is the subject of an S8_Acquisition by the collection.
domain: S1 Collection Object
range: S8 Acquisition
sub property of: P24i changed ownership through

S22 Category Or Keyword Sgs
type: Class
comment: Diese Klasse umfasst Konzepte, um Instanzen der Klasse S1_Sammlungsobjekt unter Verwendung von Begriffen aus fachspezifischen Vokabular der Schulgeschichtlichen Sammlung detailliert zu klassifizieren und charakterisieren. S22_Kategorie_Schulgeschichte bezieht sich dabei mehr auf die inhaltiche Komponente der Instanz, wie den Titel auf einem in Papierform vorhandenen Sammlungsobjekts. Beispiele: 1. Spickzettel Mathematik, Spickzettel Physik 2. Amtliches Dokument 3. Jahresbericht
comment: This class represents keywords and tags used for classification and categorisation. They are less structured than terms coming from curated thesauri or classification systems. It refers more to the content component of the instance, such as the title on a paper-based object. Examples: cheat sheet mathematics, cheat sheet physics, annual report
subclass of: E55 Type

P82a has earliest start
type: DatatypeProperty
comment: This property decribes the earliest possible start time of an instance of E52_Time-Span.
domain: E52 Time-Span

S1 Collection Object
type: Class
comment: Diese Klasse umfasst konkrete Gegenstaende, die von menschlicher Aktivitaet bewusst zum Bestand einer Sammlung hinzugefuegt wurde und kuratorisch betreut werden.
comment: This class includes concrete objects that have been intentionally added by human activity to the inventory of a collection and curated by one or more instances of E39_Actor over time.
subclass of: E22 Man-Made Object

S46 Grade
type: Class
comment: Diese Klasse umfasst den nicht-materiellen, gedanklichen Gegenstand der Jahrgangsstufe, der sich im historischen Kontext entwickelt hat. Eine Instanz der Klasse beschreibt die Gesamtheit einer Klasse (innerhalb einer Schulart), die demselben Lernabschnitt zugehoerig sind oder im gleichen Jahr eingeschult wurden. Beispiel: Jahrgangsstufen 1 bis 4 als Teil der Grund- oder Mittelschule.
comment: This class comprises the non-material, intellectual object of the grade that has developed in the historical context. An instance of S46_Grade describes the whole of a class (within a school type) belonging to the same session or to students who have been enrolled in the same year. Example: In Germany grade 1 to 4 are as part of primary school.
subclass of: E28 Conceptual Object

N1 has an inventory number
type: ObjectProperty
comment: This property records the preferred S3_Inventory_Number that was used at the time this property was used to identify an instance of the class S1_Collection_Object.
domain: S1 Collection Object
range: S3 Inventory Number
sub property of: P48 has preferred identifier
inverse of: N1i is an inventory number of

S83 Discovered Object
type: Class
comment: Diese Klasse umfasst Instanzen der Klassen E20_Biological_Object und E22_Man_Made_Object, die durch eine Instanz der Klasse S20_Aufsammelvorgang aufgrund ihrer einzigartigen Bedeutung fuer die jeweilige Fachdisziplin aufgefunden und eingesammelt wurden.
comment: This class contains instances of the classes E20_Biological_Object and E22_Man_Made_Object, which were found and collected by an instance of the class S20_Aufsammelvorgang due to their unique meaning for the respective discipline.
subclass of: E19 Physical Object

S67 Authority File ID
type: Class
comment: Diese Klasse umfasst Zeichenketten oder Kodierungen, die Instanzen der Klasse S68_Authority_File zugewiesen werden, um sie eindeutig und dauerhaft zu identifizieren.
comment: This class contains strings or encodings that are assigned to instances of the class S68_Authority_File to identify them uniquely and permanently.
subclass of: E42 Identifier

N43i is calculated sea level of
type: ObjectProperty
comment: This property describes instances of E53_Place whose sea level is calculated from reference data.
sub property of: P87i identifies

S64 Sale
type: Class
comment: Diese Klasse umfasst Instanzen gesetzlich geregelter Abgaben von Besitz, die von Instanzen der Klasse E39_Akteur ausgefuehrt werden. Eine Instanz der Klasse S64_Abgabe_Verkauf beschreibt insbesondere das Ende eines Besitzverhaeltnisses durch Verkauf oder Abgabe eines Sammlungsobjekts durch die Sammlung.
comment: This class contains instances of statutory taxes on property that are executed by instances of the class E39_Actor. An instance of class S64_Sale describes in particular the end of an ownership relationship by selling or delivering a collection object through the collection.
subclass of: E8 Acquisition

S13 Bundle Or Convolute
type: Class
comment: Diese Klasse soll Instanzen der Klasse S1_Sammlungsobjekt zu einer Einheit bzw. Gruppe zusammenfassen, welche aufgrund eines gewissen Sachverhalts, Sinns, Sammlungskonzepts oder "Kompatibilitaet zueinander" verbunden sind. Die Klasse S13_Konvolut ist eine Subklasse von E55_Type. Beispiel aus der Informatik Sammlung: Peripherie-Geraete wie Drucker und Tastatur, die zu einem bestimmten System bzw. Rechner gehoeren und deswegen zu einem Konvolut zusammengestellt wurden.
comment: This class is intended to combine instances of class S1_Collection object into a unit or group that are linked to each other on the basis of a certain facts, meaning, collection concept or "compatibility". Example: Peripheral devices, such as printers and keyboards, which belong to a certain system or computer. They have been put together to form a whole.
subclass of: E55 Type

N41 has authority file id
type: ObjectProperty
comment: This property records the preferred S67_Authority_File_ID that was up-to-date at the time. This property was used to uniquely identify an instance of the class S68_Authority_File.
domain: E1 CRM Entity
range: S67 Authority File ID
sub property of: P48 has preferred identifier
inverse of: N41i is authority file id of

S32 Telephone Number
type: Class
comment: Diese Klasse umfasst identifizierende Kennzeichen in Form von Telefonnummern, die benutzt werden, um mit Instanzen der Klasse E39_Actor zu kommunizieren. Dabei wird nicht zwischen Mobil- und Festnetzrufnummer unterschieden. Beispiel: +41 22 418 5571
comment: This class contains identifying indicators in the form of telephone numbers that are used to communicate with instances of class E39_Actor. No distinction is made between mobile and landline numbers. Example: +41 22 418 5571
subclass of: E51 Contact Point

N23 collected
type: ObjectProperty
comment: Or: N23_gathered_up
domain: S20 Collection Process
range: E19 Physical Object
sub property of: P16 used specific object
inverse of: N23i was collected by

N27 describes the physical property of
type: ObjectProperty
comment: This property describes an S1_Collection_Object as the theme of an E33_Linguistic_Object to describe its physical characteristics.
domain: E33 Linguistic Object
range: S1 Collection Object
sub property of: P129 is about
inverse of: N27i is physically described in

S49 School Type
type: Class
comment: Diese Klasse umfasst alle Arten von Schulen, die der Klasse S26_Schule zugeordnet werden koennen. Eine Instanz der Klasse beschreibt eine Stufe des Bildungsweg im ortsspezifischen Schulsystem, die zu einem ihrer Schulausrichtung und Bildungsschwerpunkt entsprechenden Abschluss fuehrt. Beispiele: Grundschule, Klosterschule, Internat, Privatschule, Gymnasium, Wirtschaftsschule
comment: This class includes all types of schools that can be assigned to class S26_School. An instance of the class describes a level of education in the local school system that leads to a degree corresponding to its school orientation and educational focus. Examples: Primary school, monastery school, boarding school, private school, High School, business school
subclass of: E55 Type