P46 forms part of
type: ObjectProperty
type: TransitiveProperty
type: NamedIndividual
comment: Quantification of the inverse property: many to many (0,n:0,n) Scope note of the inverse property: This property associates an instance of E18 Physical Thing with another instance of Physical Thing that forms part of it. The spatial extent of the composing part is included in the spatial extent of the whole. Component elements, since they are themselves instances of E18 Physical Thing, may be further analysed into sub-components, thereby creating a hierarchy of part decomposition. An instance of E18 Physical Thing may be shared between multiple wholes, for example two buildings may share a common wall. This property does not specify when and for how long a component element resided in the respective whole. If a component is not part of a whole from the beginning of existence or until the end of existence of the whole, the classes E79 Part Addition and E90 Part Removal can be used to document when a component became part of a particular whole and/or when it stopped being a part of it. For the time-span of being part of the respective whole, the component is completely contained in the place the whole occupies. This property is intended to describe specific components that are individually documented, rather than general aspects. Overall descriptions of the structure of an instance of E18 Physical Thing are captured by the P3 has note property. The instances of E57 Material of which an instance of E18 Physical Thing is composed should be documented using P45 consists of (is incorporated in). This property is transitive and asymmetric. Examples of the inverse property: - The Royal carriage (E22) forms part of the Royal train (E22). - The “Hog’s Back” (E24) forms part of the “Fosseway” (E24). In First Order Logic of the inverse property: - P46(x,y) ⇒ E18(x) - P46(x,y) ⇒ E18(y) - P46(x,y) ⇒ P132(x,y) - [P46(x,y) ∧ P46(y,z)] ⇒ P46(x,z) - P46(x,y) ⇒ (∃uzw)[E93(u) ∧ P195i (x,u) ∧ E52(z) ∧ P164(u,z) ∧ E93(w) ∧ P195i (w,y) ∧ P164(w,z) ∧ P10(w,u)] - P46(x,y) ⇒ ¬P46(y,x)
domain: E18 Physical Thing
label: P46 bildet Teil von @de
label: P46 fait partie de @fr
label: P46 faz parte de @pt
label: P46 αποτελεί μέρος του/της @el
label: P46 формирует часть @ru
label: P46 构成部分 @zh
range: E18 Physical Thing
notation: P46i

P4 has time-span
type: ObjectProperty
type: NamedIndividual
comment: Quantification: many to one, necessary (1,1:0,n) Scope note: This property associates an instance of E2 Temporal Entity with the instance of E52 Time-Span during which it was on-going. The associated instance of E52 Time-Span is understood as the real time-span during which the phenomena making up the temporal entity instance were active. More than one instance of E2 Temporal Entity may share a common instance of E52 Time-Span only if they come into being and end being due to identical declarations or events. Examples: - The Yalta Conference (E7) has time-span Yalta Conference time-span (E52). (Harbutt, 2010) In First Order Logic: - P4(x,y) ⇒ E2(x) - P4(x,y) ⇒ E52(y)
domain: E2 Temporal Entity
label: P4 a pour intervalle temporel @fr
label: P4 hat Zeitspanne @de
label: P4 tem período de tempo @pt
label: P4 βρισκόταν σε εξέλιξη @el
label: P4 имеет временной отрезок @ru
label: P4 发生时段是 @zh
range: E52 Time-Span
inverse of: P4 is time-span of
notation: P4

P150 defines typical parts of
type: ObjectProperty
type: NamedIndividual
comment: Quantification: many to many (0,n:0,n) Scope note: This property associates an instance of E55 Type “A” with an instance of E55 Type “B”, when items of type “A” typically form part of items of type “B”, such as “car motors” and “cars”. It allows types to be organised into hierarchies based on one type describing a typical part of another. This property is equivalent to “broader term partitive (BTP)” as defined in ISO 2788 and “broaderPartitive” in SKOS. This property is not transitive. This property is asymmetric. Examples: - car motors (E55) defines typical parts of cars (E55). (fictitious) In First Order Logic: - P150(x,y) ⇒ E55(x) - P150(x,y) ⇒ E55(y) - P150(x,y) ⇒ ¬P150(y,x)
domain: E55 Type
label: P150 définit les éléments typiques de @fr
range: E55 Type
inverse of: P150 defines typical wholes for
notation: P150

P70 is documented in
type: ObjectProperty
type: NamedIndividual
comment: Quantification of the inverse property: many to many, necessary (1,n:0,n) Scope note of the inverse property: This property describes the CRM Entities documented as instances of E31 Document. Documents may describe any conceivable entity, hence the link to the highest-level entity in the CIDOC CRM class hierarchy. This property is intended for cases where a reference is regarded as making a proposition about reality. This may be of a documentary character, in the scholarly or scientific sense, or a more general statement. Examples of the inverse property: - The ‘Catalogue of the Greek coins of Arabia, Mesopotamia and Persia’ (E31) documents parts of the British Museum’s Collection (E78). (British Museum & Hill, 1922) In First Order Logic of the inverse property: - P70(x,y) ⇒ E31(x) - P70(x,y) ⇒ E1(y) - P70(x,y) ⇒ P67(x,y)
domain: E1 CRM Entity
label: P70 est documenté dans @fr
label: P70 wird belegt in @de
label: P70 é documentado em @pt
label: P70 τεκμηριώνεται σε @el
label: P70 документирован в @ru
label: P70 记录在 @zh
range: E31 Document
sub property of: P67 is referred to by
notation: P70i

P67 refers to
type: ObjectProperty
type: NamedIndividual
comment: Quantification: many to many (0,n:0,n) Scope note: This property documents that an instance of E89 Propositional Object makes a statement about an instance of E1 CRM Entity. P67 refers to (is referred to by) has the P67.1 has type link to an instance of E55 Type. This is intended to allow a more detailed description of the type of reference. This differs from P129 is about (is subject of), which describes the primary subject or subjects of the instance of E89 Propositional Object. Examples: - The eBay auction listing of 4(th) July 2002 (E73) refers to silver cup 232 (E22) has type item for sale (E55). (fictitious) Properties: - P67.1 has type: E55 Type In First Order Logic: - P67(x,y) ⇒ E89(x) - P67(x,y) ⇒ E1(y) - P67(x,y,z) ⇒ [P67(x,y) ∧ E55(z)]
domain: E89 Propositional Object
label: P67 referencia @pt
label: P67 renvoie à @fr
label: P67 verweist auf @de
label: P67 αναφέρεται σε @el
label: P67 ссылается на @ru
label: P67 涉及 @zh
range: E1 CRM Entity
inverse of: P67 is referred to by
notation: P67

P150 defines typical wholes for
type: ObjectProperty
type: NamedIndividual
comment: Quantification of the inverse property: many to many (0,n:0,n) Scope note of the inverse property: This property associates an instance of E55 Type “A” with an instance of E55 Type “B”, when items of type “A” typically form part of items of type “B”, such as “car motors” and “cars”. It allows types to be organised into hierarchies based on one type describing a typical part of another. This property is equivalent to “broader term partitive (BTP)” as defined in ISO 2788 and “broaderPartitive” in SKOS. This property is not transitive. This property is asymmetric. Examples of the inverse property: - car motors (E55) defines typical parts of cars (E55). (fictitious) In First Order Logic of the inverse property: - P150(x,y) ⇒ E55(x) - P150(x,y) ⇒ E55(y) - P150(x,y) ⇒ ¬P150(y,x)
domain: E55 Type
label: P150 définit l’ensemble typique pour @fr
range: E55 Type
notation: P150i

P104 is subject to
type: ObjectProperty
type: NamedIndividual
comment: Quantification: many to many (0,n:0,n) Scope note: This property links a particular instance of E72 Legal Object to the instances of E30 Right to which it is subject. The Right is held by an instance of E39 Actor as described by P75 possesses (is possessed by). Examples: - The Beatles back catalogue (E89) is subject to reproduction right on the Beatles back catalogue (E30). (Raga, 2016) In First Order Logic: - P104(x,y) ⇒ E72(x) - P104(x,y) ⇒ E30(y)
domain: E72 Legal Object
label: P104 Gegenstand von @de
label: P104 est soumis à @fr
label: P104 está sujeito à @pt
label: P104 υπόκειται σε @el
label: P104 является объектом для @ru
label: P104 服从 @zh
range: E30 Right
inverse of: P104 applies to
notation: P104

P134 continued
type: ObjectProperty
type: NamedIndividual
comment: Quantification: many to many (0,n:0,n) Scope note: This property associates two instances of E7 Activity, where the domain is considered as an intentional continuation of the range. A continuation of an activity may happen when the continued activity is still ongoing or after the continued activity has completely ended. The continuing activity may have started already before it decided to continue the other one. Continuation implies a coherence of intentions and outcomes of the involved activities. This property is not transitive. This property is asymmetric. Examples: - The construction of the Kölner Dom (Cologne Cathedral), abandoned in the 15(th) century (E7), was continued by construction in the 19(th) century (E7). [The construction in the 19(th) century adapted the initial plans so as to preserve the intended appearance.] (Wolff, 1999) In First Order Logic: - P134(x,y) ⇒ E7(x) - P134(x,y)⇒ E7(y) - P134(x,y) ⇒ P15(x,y) - P134(x,y) ⇒ P176i(x,y) - P134(x,y) ⇒ ¬P134(y,x)
domain: E7 Activity
label: P134 a continué @fr
label: P134 continuou @pt
label: P134 setzte sich fort in @de
label: P134 συνέχισε @el
label: P134 продолжил @ru
label: P134 继续 @zh
range: E7 Activity
sub property of: P15 was influenced by
sub property of: P176 starts after the start of
inverse of: P134 was continued by
notation: P134

P123 resulted in
type: ObjectProperty
type: NamedIndividual
comment: Quantification: many to many, necessary (1,n:0,n) Scope note: This property identifies the instance or instances of E18 Physical Thing that are the result of an instance of E81 Transformation. New items replace the transformed item or items, which cease to exist as units of documentation. The physical continuity between the old and the new is expressed by the links to the common instance of E81 Transformation. Examples: - The transformation of the Venetian Loggia in Heraklion into a city hall (E81, E12) resulted in the City Hall of Heraklion (E24). [AND: has produced (P108) the City Hall of Heraklion (E22)] (Municipality of Heraklion, 2021) - The mummification of Tut-Ankh-Amun (E81, E12) resulted in the mummy of Tut-Ankh-Amun (E22,E20). [also: has produced (P108) the mummy of Tut-Ankh-Amun (E22, E20).] (Carter & Mace 1977) - The death, carbonization and petrification of some people of Pompeii in 79AD by the intense heat of a pyroclastic cloud and ashes from the eruption of Mount Vesuvius (E69, E81) resulted in petrified bodies (E20). [Some of these bodies could later be preserved in plaster.] In First Order Logic: - P123(x,y) ⇒ E81(x) - P123(x,y) ⇒ E18(y) - P123(x,y) ⇒ P92(x,y)
domain: E81 Transformation
label: P123 a eu pour résultat @fr
label: P123 ergab @de
label: P123 resultou em @pt
label: P123 είχε ως αποτέλεσμα @el
label: P123 повлек появление @ru
label: P123 结果造成 @zh
range: E18 Physical Thing
sub property of: P92 brought into existence
inverse of: P123 resulted from
notation: P123

P189 approximates
type: ObjectProperty
type: NamedIndividual
comment: Quantification: many to many (0,n:0,n) Scope note: This property associates an instance of E53 Place with another instance of E53 Place, which is defined in the same reference space, and which is used to approximate the former. The property does not necessarily state the quality or accuracy of this approximation, but rather indicates the use of the first instance of place to approximate the second. In common documentation practice, find or encounter spots e.g. in archaeology, botany or zoology are often related to the closest village, river or other named place without detailing the relation, e.g. if it is located within the village or in a certain distance of the specified place. In this case the stated “phenomenal” place found in the documentation can be seen as an approximation of the actual encounter spot without more specific knowledge. In more recent documentation often point coordinate information is provided that originates from GPS measurements or georeferencing from a map. This point coordinate information does not state the actual place of the encounter spot but tries to approximate it with a “declarative” place. The accuracy depends on the methodology used when creating the coordinates. It may be dependent on technical limitations like GPS accuracy but also on the method where the GPS location is taken in relation to the measured feature. If the methodology is known a maximum deviation from the measured point can be calculated and the encounter spot or feature may be related to the resulting circle using an instance of P171 at some place within. This property is not transitive. This property is reflexive. Examples: - [40°31'17.9"N 21°15'48.3"E] (E53) approximates Kastoria, Greece, TGN ID: 7010880 (E53). [The approximating declarative place with point shape is defined in terms of coordinates taken from https://sws.geonames.org/735927] - [40°31'00.1"N 21°16'00.1"E] (E53) approximates Kastoria, Greece, TGN ID: 7010880 (E53). [The approximating declarative p…
domain: E53 Place
label: P189 approxime @fr
range: E53 Place
inverse of: P189 is approximated by
notation: P189

P71 lists
type: ObjectProperty
type: NamedIndividual
comment: Quantification: many to many (0,n:0,n) Scope note: This property associates an instance of E32 Authority Document with an instance of E1 CRM Entity which it lists for reference purposes. Examples: - The Art & Architecture Thesaurus (E32) lists alcazars (E55). (http://vocab.getty.edu/page/aat/300006897) In First Order Logic: - P71(x,y) ⇒ E32(x) - P71(x,y) ⇒ E1(y) - P71(x,y) ⇒ P67(x,y)
domain: E32 Authority Document
label: P71 define @pt
label: P71 listet @de
label: P71 énumère @fr
label: P71 περιλαμβάνει @el
label: P71 перечисляет @ru
label: P71 列出 @zh
range: E1 CRM Entity
sub property of: P67 refers to
inverse of: P71 is listed in
notation: P71

E4 Period
type: Class
type: NamedIndividual
comment: Scope note: This class comprises sets of coherent phenomena or cultural manifestations occurring in time and space. It is the social or physical coherence of these phenomena that identify an instance of E4 Period and not the associated spatiotemporal extent. This extent is only the “ground” or space in an abstract physical sense that the actual process of growth, spread and retreat has covered. Consequently, different periods can overlap and coexist in time and space, such as when a nomadic culture exists in the same area and time as a sedentary culture. This also means that overlapping land use rights, common among first nations, amounts to overlapping periods. Often, this class is used to describe prehistoric or historic periods such as the “Neolithic Period”, the “Ming Dynasty” or the “McCarthy Era”, but also geopolitical units and activities of settlements are regarded as special cases of E4 Period. However, there are no assumptions about the scale of the associated phenomena. In particular all events are seen as synthetic processes consisting of coherent phenomena. Therefore, E4 Period is a superclass of E5 Event. For example, a modern clinical birth, an instance of E67 Birth, can be seen as both a single event, i.e. an instance of E5 Event, and as an extended period, i.e. an instance of E4 Period, that consists of multiple physical processes and complementary activities performed by multiple instances of E39 Actor. E4 Period is a subclass of E2 Temporal Entity and of E92 Spacetime Volume. The latter is intended as a phenomenal spacetime volume as defined in CIDOC CRMgeo (Doerr & Hiebel, 2013). By virtue of this multiple inheritance, it is possible to discuss the physical extent of an instance of E4 Period without representing each instance of it together with an instance of its associated spacetime volume. This model combines two quite different kinds of substance: an instance of E4 Period is a phenomenon while an instance of E92 Spacetime Volume is an aggrega…
label: E4 Período @pt
label: E4 Phase @de
label: E4 Période @fr
label: E4 Περίοδος @el
label: E4 Период @ru
label: E4 时期 @zh
subclass of: E2 Temporal Entity
subclass of: E92 Spacetime Volume
subclass of: Restriction
  on property: P7 took place at
  some values from: E53 Place
notation: E4

P29 custody received by
type: ObjectProperty
type: NamedIndividual
comment: Quantification: many to many (0,n:0,n) Scope note: This property identifies the instance(s) of E39 Actor who receive custody of an instance of E18 Physical Thing in an instance of E10 Transfer of Custody. The property will typically describe Actors receiving custody of an object when it is handed over from another Actor’s care. On occasion, physical custody may be received involuntarily or illegally, e.g. through accident, unsolicited donation, or theft. In reality, custody is either transferred to someone or from someone, or both. Examples: - Representatives of The National Gallery (E74) received custody through the delivery of the paintings by Secure Deliveries Inc. to the National Gallery (E10). In First Order Logic: - P29(x,y) ⇒ E10(x) - P29(x,y) ⇒ E39(y) - P29(x,y) ⇒ P14(x,y)
domain: E10 Transfer of Custody
label: P29 a confié la garde par @fr
label: P29 custódia recebida por @pt
label: P29 übertrug Gewahrsam auf @de
label: P29 μετεβίβασε κατοχή σε @el
label: P29 опека получена @ru
label: P29 监护权转至 @zh
range: E39 Actor
sub property of: P14 carried out by
inverse of: P29 received custody through
notation: P29

P90b has upper value limit
type: DatatypeProperty
type: NamedIndividual
domain: E54 Dimension
sub property of: P90 has value
notation: P90b

P111 was added by
type: ObjectProperty
type: NamedIndividual
comment: Quantification of the inverse property: many to many, necessary (1,n:0,n) Scope note of the inverse property: This property identifies the instance of E18 Physical Thing that is added during an instance of E79 Part Addition activity. Examples of the inverse property: - The insertion of the final nail (E79) added the last nail in George VI’s coffin (E22). (https://www.rct.uk/collection/2000811/the-coffin-of-king-george-vi-during-the-lying-in-state) In First Order Logic of the inverse property: - P111(x,y) ⇒ E79(x) - P111(x,y) ⇒ E18(y) - P111(x,y) ⇒ P16(x,y)
domain: E18 Physical Thing
label: P111 a été ajouté par @fr
label: P111 foi adicionado por @pt
label: P111 wurde hinzugefügt durch @de
label: P111 προστέθηκε από @el
label: P111 был добавлен посредством @ru
label: P111 被增加 @zh
range: E79 Part Addition
sub property of: P16 was used for
notation: P111i

P17 motivated
type: ObjectProperty
type: NamedIndividual
comment: Quantification of the inverse property: many to many (0,n:0,n) Scope note of the inverse property: This property describes an item or items that are regarded as a reason for carrying out the instance of E7 Activity. For example, the discovery of a large hoard of treasure may call for a celebration, an order from headquarters can start a military manoeuvre. Examples of the inverse property: - The resignation of the chief executive (E7) was motivated by the collapse of SwissAir (E68). - The coronation of Elizabeth II (E7) was motivated by the death of George VI (E69). (Strong, 2005) In First Order Logic of the inverse property: - P17(x,y) ⇒ E7(x) - P17(x,y) ⇒ E1(y) - P17(x,y) ⇒ P15(x,y)
domain: E1 CRM Entity
label: P17 a motivé @fr
label: P17 motivou @pt
label: P17 regte an @de
label: P17 ήταν αφορμή @el
label: P17 обусловил @ru
label: P17 促动 @zh
range: E7 Activity
sub property of: P15 influenced
notation: P17i

P28 surrendered custody through
type: ObjectProperty
type: NamedIndividual
comment: Quantification of the inverse property: many to many (0,n:0,n) Scope note of the inverse property: This property identifies the instance(s) of E39 Actor who surrender custody of an instance of E18 Physical Thing in an instance of E10 Transfer of Custody. The property will typically describe an Actor surrendering custody of an object when it is handed over to someone else’s care. On occasion, physical custody may be surrendered involuntarily, e.g. through accident, loss, or theft. In reality, custody is either transferred to someone or from someone, or both. Examples of the inverse property: - The Secure Deliveries Inc. crew (E74) surrendered custody through the delivery of the paintings by Secure Deliveries Inc. to the National Gallery (E10). In First Order Logic of the inverse property: - P28(x,y) ⇒ E10(x) - P28(x,y) ⇒ E39(y) - P28(x,y) ⇒ P14(x,y)
domain: E39 Actor
label: P28 a cédé la garde par @fr
label: P28 final da custódia por meio de @pt
label: P28 wurde Gewahrsam übergeben durch @de
label: P28 παρέδωσε κατοχή μέσω @el
label: P28 опека отдана через @ru
label: P28 出让监护权 @zh
range: E10 Transfer of Custody
sub property of: P14 performed
notation: P28i

E97 Monetary Amount
type: Class
type: NamedIndividual
comment: Scope note: This class comprises quantities of monetary possessions or obligations in terms of their nominal value with respect to a particular currency. These quantities may be abstract accounting units, the nominal value of a heap of coins or bank notes at the time of validity of the respective currency, the nominal value of a bill of exchange or other documents expressing monetary claims or obligations. It specifically excludes amounts expressed in terms of weights of valuable items, like gold and diamonds, and quantities of other non-currency items, like goats or stocks and bonds. Examples: - Christie’s hammer price for Vincent van Gogh’s “Still Life: Vase with Fifteen Sunflowers” in London on 30(th) March 1987 In First Order Logic: - E97(x) ⇒ E54(x)
label: E97 Valeur monétaire @fr
subclass of: E54 Dimension
notation: E97

P2 is type of
type: ObjectProperty
type: NamedIndividual
comment: Quantification of the inverse property: many to many (0,n:0,n) Scope note of the inverse property: This property allows sub-typing of CIDOC CRM entities –a form of specialisation – through the use of a terminological hierarchy, or thesaurus. The CIDOC CRM is intended to focus on the high-level entities and relationships needed to describe data structures. Consequently, it does not specialise entities any further than is required for this immediate purpose. However, entities in the isA hierarchy of the CIDOC CRM may by specialised into any number of sub-entities, which can be defined in the E55 Type hierarchy. E41 Appellation, for example, may be specialised into “e-mail address”, “telephone number”, “post office box”, “URL”, etc., none of which figures explicitly in the CIDOC CRM class hierarchy. A comprehensive explanation about refining CIDOC CRM concepts by E55 Type is given in the section “About Types” in the section on “Specific Modelling Constructs” of this document. This property is a shortcut for the path from E1 CRM Entity through P41i was classified by, E17 Type Assignment, P42 assigned to E55 Type. Examples of the inverse property: - “enquiries@cidoc-crm.org” (E41) has type e-mail address (E55). (fictitious) In First Order Logic of the inverse property: - P2(x,y) ⇒ E1(x) - P2(x,y) ⇒ E55(y) - P2(x,y) ⇐ (∃z) [E17(z)] ˄ P41i(x,z) ˄ P42(z,y)]
domain: E55 Type
label: P2 est le type de @fr
label: P2 ist Typus von @de
label: P2 é o tipo de @pt
label: P2 είναι ο τύπος του/της @el
label: P2 является типом для @ru
label: P2 是类型 @zh
range: E1 CRM Entity
notation: P2i

P13 destroyed
type: ObjectProperty
type: NamedIndividual
comment: Quantification: one to many, necessary (1,n:0,1) Scope note: This property links an instance of E6 Destruction to an instance of E18 Physical Thing that has been destroyed by it. Destruction implies the end of an item’s life as a subject of cultural documentation – the physical matter of which the item was composed may in fact continue to exist. An instance of E6 Destruction may be contiguous with an instance of E12 Production that brings into existence a derived object composed partly of matter from the destroyed object. Examples: - The Tay Bridge Disaster (E6) destroyed the Tay Bridge (E22). (Thomas, 1972) In First Order Logic: - P13(x,y) ⇒ E6 (x) - P13(x,y) ⇒ E18(y) - P13(x,y) ⇒ P93(x,y)
domain: E6 Destruction
label: P13 a détruit @fr
label: P13 destruiu @pt
label: P13 zerstörte @de
label: P13 κατέστρεψε @el
label: P13 уничтожил @ru
label: P13 破坏了 @zh
range: E18 Physical Thing
sub property of: P93 took out of existence
inverse of: P13 was destroyed by
notation: P13

E63 Beginning of Existence
type: Class
type: NamedIndividual
comment: Scope note: This class comprises events that bring into existence any instance of E77 Persistent Item. It may be used for temporal reasoning about things (intellectual products, physical items, groups of people, living beings) beginning to exist; it serves as a hook for both a terminus post quem and a terminus ante quem. Examples: - the birth of my child (E67) (fictitious) - the birth of Snoopy, my dog (fictitious) - the calving of the iceberg that sank the Titanic - the construction of the Eiffel Tower (E12) (Tissandier, 1889) In First Order Logic: - E63(x) ⇒ E5(x)
label: E63 Daseinsbeginn @de
label: E63 Début d’existence @fr
label: E63 Início da Existência @pt
label: E63 Αρχή Ύπαρξης @el
label: E63 Начало Существования @ru
label: E63 初始 @zh
subclass of: E5 Event
subclass of: Restriction
  on property: P92 brought into existence
  some values from: E77 Persistent Item
notation: E63

E55 Type
type: Class
type: NamedIndividual
comment: Scope note: This class comprises concepts denoted by terms from thesauri and controlled vocabularies used to characterize and classify instances of CIDOC CRM classes. Instances of E55 Type represent concepts, in contrast to instances of E41 Appellation which are used to name instances of CIDOC CRM classes. E55 Type provides an interface to domain specific ontologies and thesauri. These can be represented in the CIDOC CRM as subclasses of E55 Type, forming hierarchies of terms, i.e. instances of E55 Type linked via P127 has broader term (has narrower term): E55 Type. Such hierarchies may be extended with additional properties. Examples: - weight, length, depth [types for instances of E54 Dimension] - portrait, sketch, animation [types for instances of E36 Visual Item] - French, English, German [types for instances of E56 Language] - excellent, good, poor [types for instances of E3 Condition State] - Ford Model T, chop stick [types for instances of E22 Human-Made Object] - cave, doline, scratch [types for instances of E26 Physical Feature] - poem, short story [types for instances of E33 Linguistic Object] - wedding, earthquake, skirmish [types for instances of E5 Event] In First Order Logic: - E55(x) ⇒ E28(x)
label: E55 Tipo @pt
label: E55 Typus @de
label: E55 Τύπος @el
label: E55 Тип @ru
label: E55 类型 @zh
subclass of: E28 Conceptual Object
subclass of: Restriction
  max cardinality: 1
  on property: P135 was created by
notation: E55

P183 starts after the end of
type: ObjectProperty
type: TransitiveProperty
type: NamedIndividual
comment: Quantification of the inverse property: many to many (0,n:0,n) Scope note of the inverse property: This property specifies that the temporal extent of the domain instance A of E2 Temporal Entity ends definitely before the start of the temporal extent of the range instance B of E2 Temporal Entity. In other words, if A = [A(start), A(end)] and B = [B(start), B(end)], it means A(end) < B(start) is true. This property is part of the set of temporal primitives P173 – P176, P182 – P185. This property corresponds to the following Allen temporal relation (Allen, 1983) : {before}. This property is transitive. This property is asymmetric. https://cidoc-crm.org/html/version_images/images_7.1.3/image_11.png Figure 18: Temporal entity A ends before the start of temporal entity B. Here A is longer than B https://cidoc-crm.org/html/version_images/images_7.1.3/image_12.png Figure 19: Temporal entity A ends before the start of temporal entity B. Here A is shorter than B Examples of the inverse property: - Gisle taking office as Bishop of Linköping 1139 AD (E7) ends before the start of The Guta saga composition (E65). (Peel, 1999) - Troy VII (E4) ends before the start of Troy VIII (E4). [uninhabited for some 200 years] - The use of the Tomb Four from Nikitopoulou group in Nihoria in the MHIII-LHI period (E4) ends before the start of the period of reuse of the Tomb Four from Nikitopoulou group in LHIIIA (E4). [“Of the six tombs excavated in the Nikitopoulou group […] the finds in Tomb Four are of MH II or MH III-LH I date, with the exception of the finds with the Northern group of material, which is uniformly dated to LHIIA2, end the ewer in the middle of the floor, dated LHIIIA1. […] The preserved evidence seems clearly to indicate use in the MHIII-LHI use in the MHIII-LHI period followed by a period of reuse in LHIIIA, a pattern matched at architecturally similar sites such as 13:Kaminia and 10:Gouvalári.”] (Boyd, 2002) In First Order Logic of the inverse property: - P183(x,y) ⇒ E2(…
domain: E2 Temporal Entity
label: P183 commence après la fin de @fr
range: E2 Temporal Entity
sub property of: P182 starts after or with the end of
notation: P183i

P1 is identified by
type: ObjectProperty
type: NamedIndividual
comment: Quantification: many to many (0,n:0,n) Scope note: This property describes the naming or identification of any real-world item by a name or any other identifier. This property is intended for identifiers in general use, which form part of the world the model intends to describe, and not merely for internal database identifiers which are specific to a technical system, unless these latter also have a more general use outside the technical context. This property includes in particular identification by mathematical expressions such as coordinate systems used for the identification of instances of E53 Place. The property does not reveal anything about when, where and by whom this identifier was used. A more detailed representation can be made using the fully developed (i.e. indirect) path through E15 Identifier Assignment. This property is a shortcut for the path from E1 CRM Entity through P140i was attributed by, E15 Identifier Assignment, P37 assigned to E42 Identifier. It is also a shortcut for the path from E1 CRM Entity through P1 is identified by, E41 Appellation, P139 has alternative form to E41 Appellation. Examples: - The capital of Italy (E53) is identified by “Rome” (E41). (Leach, 2017) - Text 25014–32 (E33) is identified by “The Decline and Fall of the Roman Empire” (E35). (Gibbon, 2013) In First Order Logic: - P1(x,y) ⇒ E1(x) - P1(x,y) ⇒ E41(y) - P1(x,y) ⇐ (∃z) [E15(z)˄ P140i(x,z) ˄ P37(z,y)] - P1(x,y) ⇐ (∃z) [E41(z)˄ P1(x,z) ˄ P139(z,y)]
domain: E1 CRM Entity
label: P1 est identifié par @fr
label: P1 wird bezeichnet als @de
label: P1 é identificado por @pt
label: P1 αναγνωρίζεται ως @el
label: P1 идентифицируется посредством @ru
label: P1 被标识为 @zh
range: E41 Appellation
inverse of: P1 identifies
notation: P1

E10 Transfer of Custody
type: Class
type: NamedIndividual
comment: Scope note: This class comprises transfers of the physical custody or the legal responsibility for the physical custody of objects. The recording of the donor or recipient is optional. It is possible that in an instance of E10 Transfer of Custody there is either no donor or no recipient. Depending on the circumstances, it may describe: 1. the beginning of custody (there is no previous custodian) 2. the end of custody (there is no subsequent custodian) 3. the transfer of custody (transfer from one custodian to the next) 4. the receipt of custody from an unknown source (the previous custodian is unknown) 5. the declared loss of an object (the current or subsequent custodian is unknown) In the event that only a single kind of transfer of custody occurs, either the legal responsibility for the custody or the actual physical possession of the object but not both, this difference should be expressed using the property P2 has type (is type of). The sense of physical possession requires that the object of custody be in the hands of the keeper at least with a part representative for the whole. The way, in which a representative part is defined, should ensure that it is unambiguous who keeps a part and who the whole and should be consistent with the identity criteria of the kept instance of E18 Physical Thing. The interpretation of the museum notion of "accession" differs between institutions. The CIDOC CRM therefore models legal ownership and physical custody separately. Institutions will then model their specific notions of accession and deaccession as combinations of these. Theft is a specific case of illegal transfer of custody. Examples: - the delivery of the paintings by Secure Deliveries Inc. to the National Gallery - the return of Picasso’s “Guernica” to Madrid’s Prado in 1981 (Chipp, 1988) - the transfer of custody of the work described as “Von der Velden ein Ufer an der See” from Johann Matthäus von Merian to the Auction House Heldevier (Jacob) for the purpose of sa…
label: E10 Transfert de la garde @fr
label: E10 Transferência de Custódia @pt
label: E10 Übertragung des Gewahrsams @de
label: E10 Μεταβίβαση Κατοχής @el
label: E10 Передача Опеки @ru
label: E10 转移监护权 @zh
subclass of: E7 Activity
subclass of: Restriction
  on property: P30 transferred custody of
  some values from: E18 Physical Thing
notation: E10

P151 participated in
type: ObjectProperty
type: NamedIndividual
comment: Quantification of the inverse property: many to many (0,n:0,n) Scope note of the inverse property: This property associates an instance of E66 Formation with an instance of E74 Group from which the new group was formed preserving a sense of continuity such as in mission, membership or tradition. Examples of the inverse property: - The formation of the House of Bourbon-Conti in 1581 (E66) was formed from House of Condé (E74). (Collectif & Musée d'art et d'histoire Louis-Senlecq, 1900) In First Order Logic of the inverse property: - P151(x,y) ⇒ E66(x) - P151(x,y) ⇒ E74(y) - P151(x,y) ⇒ P11(x,y)
domain: E74 Group
label: P151 a participé à @fr
range: E66 Formation
sub property of: P11 participated in
notation: P151i

P53 is former or current location of
type: ObjectProperty
type: NamedIndividual
comment: Quantification of the inverse property: many to many, necessary (1,n:0,n) Scope note of the inverse property: This property identifies an instance of E53 Place as the former or current location of an instance of E18 Physical Thing. In the case of instances of E19 Physical Object, the property does not allow any indication of the Time-Span during which the instance of E19 Physical Object was located at this instance of E53 Place, nor if this is the current location. In the case of immobile objects, the Place would normally correspond to the Place of creation. This property is a shortcut. A more detailed representation can make use of the fully developed (i.e. indirect) path from E19 Physical Object, though, P25i moved by, E9 Move, P26 moved to or P27 moved from to E53 Place. Examples of the inverse property: - Silver cup 232 (E22) has former or current location Display Case 4, Room 23, Museum of Oxford (E53). (fictitious) In First Order Logic of the inverse property: - P53(x,y) ⇒ E18(x) - P53(x,y) ⇒ E53(y) - P53(x,y) ⇐ (∃z) [E9(z) ˄ P25i(x,z) ˄ [P26(z,y) ˅ P27(z,y)]]
domain: E53 Place
label: P53 est la localisation actuelle ou antérieure de @fr
label: P53 ist früherer oder derzeitiger Standort von @de
label: P53 é ou foi localização de @pt
label: P53 είναι ή ήταν θέση του @el
label: P53 является текущим или бывшим местоположением для @ru
label: P53 是之前或当前位置 @zh
range: E18 Physical Thing
notation: P53i

P40 observed dimension
type: ObjectProperty
type: NamedIndividual
comment: Quantification: many to many, necessary (1,n:0,n) Scope note: This property records the dimension that was observed in an E16 Measurement Event. E54 Dimension can be any quantifiable aspect of E70 Thing. Weight, image colour depth and monetary value are dimensions in this sense. One measurement activity may determine more than one dimension of one object. Dimensions may be determined either by direct observation or using recorded evidence. In the latter case the measured Thing does not need to be present or extant. Even though knowledge of the value of a dimension requires measurement, the dimension may be an object of discourse prior to, or even without, any measurement being made. Examples: - The measurement of the height of silver cup 232 on 31(st) August 1997 (E16) observed dimension silver cup 232 height (E54). [which has unit mm (E58), has value 224 (E60)] (fictitious) - The carbon 14 dating of the “Schoeninger Speer II” in 1996 (E16) observed dimension the carbon 14 based temporal distance from 1996 to the growth of the wood of the “Schoeninger Speer II” (E60). [The carbon 14 dating of an approximately 400.000 year old complete Old Palaeolithic wooden spear found in Schoeningen, Niederachsen, Germany, in 1995. See also: E16 Measurement.] (Kouwenhoven, 1997) In First Order Logic: - P40(x,y) ⇒ E16(x) - P40(x,y)⇒ E54(y) - P40(x,y) ⇒ P141(x,y)
domain: E16 Measurement
label: P40 a relevé comme dimension @fr
label: P40 beobachtete Dimension @de
label: P40 verificou a dimensão @pt
label: P40 παρατήρησε @el
label: P40 определил величину @ru
label: P40 观测度量规格 @zh
range: E54 Dimension
sub property of: P141 assigned
inverse of: P40 was observed in
notation: P40

P49 has former or current keeper
type: ObjectProperty
type: NamedIndividual
comment: Quantification: many to many (0,n:0,n) Scope note: This property identifies the instance of E39 Actor who has or has had custody of an instance of E18 Physical Thing at some time. This property leaves open the question if parts of this physical thing have been added or removed during the time-spans it has been under the custody of this actor, but it is required that at least a part which can unambiguously be identified as representing the whole has been under this custody for its whole time. The way, in which a representative part is defined, should ensure that it is unambiguous who keeps a part and who the whole and should be consistent with the identity criteria of the kept instance of E18 Physical Thing. The distinction with P50 has current keeper (is current keeper of) is that P49 has former or current keeper (is former or current keeper of) leaves open the question as to whether the specified keepers are current. This property is a shortcut for the more detailed path from E18 Physical Thing through P30i custody transferred through, E10 Transfer of Custody, P28 custody surrendered by or P29 custody received by to E39 Actor. Examples: - The paintings from The Iveagh Bequest (E78) has former or current keeper Secure Deliveries Inc. (E74). In First Order Logic: - P49(x,y) ⇒ E18(x) - P49(x,y) ⇒ E39(y) - P49(x,y) ⇐ (∃z) [E10(z) ˄ P30i(x,z) ˄ [P28(z,y) ˅ P29(z,y) ]]
domain: E18 Physical Thing
label: P49 a pour actant détenteur actuel ou antérieur @fr
label: P49 hat früheren oder derzeitigen Betreuer @de
label: P49 é ou foi guardada por @pt
label: P49 είναι ή ήταν στην κατοχή του @el
label: P49 имеет бывшего или текущего смотрителя @ru
label: P49 有以往或当前保管者 @zh
range: E39 Actor
inverse of: P49 is former or current keeper of
notation: P49

P76 has contact point
type: ObjectProperty
type: NamedIndividual
comment: Quantification: many to many (0,n:0,n) Scope note: This property associates an instance of E39 Actor to an instance of E41 Appellation which a communication service uses to direct communications to this actor, such as an e-mail address, fax number, or postal address. Examples: - The Research Libraries Group, Inc. (RLG) (E74) has contact point “bl.ric@rlg.org” (E41) In First Order Logic: - P76(x,y) ⇒ E39(x) - P76(x,y) ⇒ E41(y)
domain: E39 Actor
label: P76 a pour coordonnées @fr
label: P76 hat Kontaktpunkt @de
label: P76 possui ponto de contato @pt
label: P76 έχει σημείο επικοινωνίας @el
label: P76 имеет контакт @ru
label: P76 有联系方式 @zh
range: E41 Appellation
inverse of: P76 provides access to
notation: P76

P141 was assigned by
type: ObjectProperty
type: NamedIndividual
comment: Quantification of the inverse property: many to many (0,n:0,n) Scope note of the inverse property: This property associates an instance of E13 Attribute Assignment with the instance of E1 CRM Entity used in the attribution. The instance of E1 CRM Entity here plays the role of the range of the attribution. The kind of attribution made should be documented using P177 assigned property of type (is type of property assigned). Examples of the inverse property: - The Current Ownership Assessment of Martin Doerr’s silver cup February 1997 (E13) assigned Martin Doerr (E21). (fictitious) - The Identifier Assignment on 1(st) June 1997 of the silver cup donated by Martin Doerr (E15) assigned 232 (E42). (fictitious) - The examination of MS Sinai Greek 418 (E13) assigned unsupported (E55.) (Honey & Pickwoad, 2010) In First Order Logic of the inverse property: - P141(x,y) ⇒ E13(x) - P141(x,y) ⇒ E1(y)
domain: E1 CRM Entity
label: P141 a été attribué par @fr
label: P141 foi atribuído por @pt
label: P141 wurde zugewiesen durch @de
label: P141 αποδόθηκε από @el
label: P141 был присвоен посредством @ru
label: P141 被分配 @zh
range: E13 Attribute Assignment
notation: P141i

P32 was technique of
type: ObjectProperty
type: NamedIndividual
comment: Quantification of the inverse property: many to many (0,n:0,n) Scope note of the inverse property: This property identifies the technique or method, modelled as an instance of E55 Type, that was employed in an instance of E7 Activity. These techniques should be drawn from an external E55 Type hierarchy of consistent terminology of general techniques or methods such as embroidery, oil-painting, carbon dating, etc. Specific documented techniques should be described as instances of E29 Design or Procedure. Examples of the inverse property: - The ornamentation of silver cup 113 (E11) used general technique gold-plating (E55). [A Design or Procedure type] (fictitious) In First Order Logic of the inverse property: - P32(x,y) ⇒ E7(x) - P32(x,y) ⇒ E55(y) - P32(x,y) ⇒ P125(x,y)
domain: E55 Type
label: P32 a été la technique générale mise en œuvre dans @fr
label: P32 foi técnica da @pt
label: P32 war Verfahren von @de
label: P32 ήταν τεχνική του/της @el
label: P32 был техникой для @ru
label: P32 是技术 @zh
range: E7 Activity
sub property of: P125 was type of object used in
notation: P32i

P96 by mother
type: ObjectProperty
type: NamedIndividual
comment: Quantification: many to one, necessary (1,1:0,n) Scope note: This property links an instance of E67 Birth to an instance of E21 Person in the role of birth-giving mother. Note that biological fathers are not necessarily participants in the Birth (see P97 from father (was father for)). The instance of E21 Person being born is linked to the instance of E67 Birth with the property P98 brought into life (was born). This is not intended for use with general natural history material, only people. There is no explicit method for modelling conception and gestation except by using extensions. Examples: - The birth of Queen Elizabeth II (E67) by mother Her Majesty Queen Elizabeth The Queen Mother (E21). (Parker, 2002) In First Order Logic: - P96(x,y) ⇒ E67(x) - P96(x,y) ⇒ E21(y) - P96(x,y) ⇒ P11(x,y)
domain: E67 Birth
label: P96 de mère @fr
label: P96 durch Mutter @de
label: P96 pela mãe @pt
label: P96 είχε μητέρα @el
label: P96 посредством матери @ru
label: P96 来自母亲 @zh
range: E21 Person
sub property of: P11 had participant
inverse of: P96 gave birth
notation: P96

P48 is preferred identifier of
type: ObjectProperty
type: NamedIndividual
comment: Quantification of the inverse property: many to one (0,1:0,n) Scope note of the inverse property: This property records the preferred instance of E42 Identifier that was used to identify an instance of E1 CRM Entity at the time this property was recorded. More than one preferred identifier may have been assigned to an item over time. Use of this property requires an external mechanism for assigning temporal validity to the respective CIDOC CRM instance. The fact that an identifier is a preferred one for an organisation can be better expressed in a context independent form by assigning a suitable instance of E55 Type to the respective instance of E15 Identifier Assignment using the P2 has type property. Examples of the inverse property: - The pair of Lederhosen donated by Dr. Martin Doerr (E22) has preferred identifier “OXCMS:2001.1.32” (E42). (fictitious) In First Order Logic of the inverse property: - P48(x,y) ⇒ E1(x) - P48(x,y) ⇒ E42(y) - P48(x,y) ⇒ P1(x,y)
domain: E42 Identifier
label: P48 est l’identifiant préférentiel de @fr
label: P48 ist bevorzugtes Kennzeichen für @de
label: P48 é o identificador preferido de @pt
label: P48 είναι προτιμώμενο αναγνωριστικό @el
label: P48 является предпочтительным идентификатором для @ru
label: P48 是优选标识符 @zh
range: E1 CRM Entity
sub property of: P1 identifies
notation: P48i

E19 Physical Object
type: Class
type: NamedIndividual
comment: Scope note: This class comprises items of a material nature that are units for documentation and have physical boundaries that separate them completely in an objective way from other objects. The class also includes all aggregates of objects made for functional purposes of whatever kind, independent of physical coherence, such as a set of chessmen. Typically, instances of E19 Physical Object can be moved (if not too heavy). In some contexts, such objects, except for aggregates, are also called “bona fide objects”, i.e. naturally defined objects (Smith & Varzi, 2000). The decision as to what is documented as a complete item, rather than by its parts or components, may be purely administrative or may be a result of the order in which the item was acquired. Examples: - Aphrodite of Milos (E22) (Kousser, 2005) - the Cullinan Diamond (Scarratt and Shor, 2006) - Apollo 13 at the time of launch (E22) (Lovell and Kluger, 1994) In First Order Logic: - E19(x) ⇒ E18(x)
label: E19 Materieller Gegenstand @de
label: E19 Objet matériel @fr
label: E19 Objeto Material @pt
label: E19 Υλικό Αντικείμενο @el
label: E19 Физический Объект @ru
label: E19 物质对象 @zh
subclass of: E18 Physical Thing
subclass of: Restriction
  max cardinality: 1
  on property: P54 has current permanent location
subclass of: Restriction
  max cardinality: 1
  on property: P55 has current location
notation: E19

P73 has translation
type: ObjectProperty
type: NamedIndividual
comment: Quantification: many to many (0,n:0,n) Scope note: This property links an instance of E33 Linguistic Object (A), to another instance of E33 Linguistic Object (B) which is the translation of A. When an instance of E33 Linguistic Object is translated into a new language a new instance of E33 Linguistic Object is created, despite the translation being conceptually similar to the source. This property is asymmetric. Examples: - “Les Baigneurs” (E33) has translation “The Bathers” (E33). (Spiers & Surenne, 1854) In First Order Logic: - P73(x,y) ⇒ E33(x) - P73(x,y) ⇒ E33(y) - P73(x,y) ⇒ P130i(x,y) - P73(x,y) ⇒ ¬P73(y,x)
domain: E33 Linguistic Object
label: P73 a pour traduction @fr
label: P73 hat Übersetzung @de
label: P73 tem tradução @pt
label: P73 έχει μετάφραση @el
label: P73 имеет перевод @ru
label: P73 有译文 @zh
range: E33 Linguistic Object
sub property of: P130 features are also found on
inverse of: P73 is translation of
notation: P73

P175 starts before or with the start of
type: ObjectProperty
type: NamedIndividual
comment: Quantification: many to many (0,n:0,n) Scope note: This property specifies that the temporal extent of the domain instance A of E2 Temporal Entity starts before or simultaneously with the start of the temporal extent of the range instance B of E2 Temporal Entity. In other words, if A = [A(start), A(end)] and B = [B(start), B(end)], it means A(start) ≤ B(start) is true. This property is part of the set of temporal primitives P173 – P176, P182 – P185. This property corresponds to a disjunction (logical OR) of the following Allen temporal relations (Allen, 1983): {before, meets, overlaps, starts, started-by, contains, finished-by, equals} In a model with fuzzy borders, this property will not be transitive. This property is irreflexive. https://cidoc-crm.org/html/version_images/images_7.1.3/image_05.png Figure 12: Temporal entity A starts before or with the start of temporal entity B. Here A is longer than B https://cidoc-crm.org/html/version_images/images_7.1.3/image_06.png Figure 13: Temporal entity A starts before or with the start of temporal entity B. Here A is shorter than B Examples: - The production of the scarab seal found in Poros in a context of LMIIIB (E12) starts after or with the start of Tutankhamun period (1332-1323 B.C) (E4). [The scarab stamp seal found in Poros was associated with finds dated to the LMIIIB period. The seal is dated to the Tutankhamun period or later because it belongs to the scarabs of type “nh.s n Jmn”: During Akhenaten period, the production of this type of scarab seal stopped (the name of Amun is not referred to during his reign). Therefore, the scarab cannot have been produced before the Tutankhamun period and is probably a later production] (Karetsou, 2000) - The production of the cylindrical seal of the first Dynasty of Babylon found in Tholos B in Platanos (E12) starts after or with the start of the Hammurabi period of the kingdom (E4). [Of the cylindrical seal of the first Dynasty of Babylon found in tholos B in Platanos belie…
domain: E2 Temporal Entity
label: P175 commence avant ou au moment du début de @fr
range: E2 Temporal Entity
sub property of: P174 starts before the end of
inverse of: P175 starts after or with the start of
notation: P175

P34 concerned
type: ObjectProperty
type: NamedIndividual
comment: Quantification: many to many, necessary (1,n:0,n) Scope note: This property identifies the instance of E18 Physical Thing that was assessed during an instance of E14 Condition Assessment. Conditions may be assessed either by direct observation or using recorded evidence. In the latter case the instance of E18 Physical Thing does not need to be present or extant at the time of assessment. Examples: - The condition assessment of the silver collection in 1997 (E14) concerned silver cup 232 (E22). (fictitious) - The condition assessment of the cover of MS Sinai Greek 418 (E14) concerned the cover of MS Sinai Greek 418 (E22). (Honey and Pickwoad, 2010) - The condition assessment of the endband cores of MS Sinai Greek 418 (E14) concerned the endband cores of MS Sinai Greek 418 (E22). (Honey and Pickwoad, 2010) In First Order Logic: - P34(x,y) ⇒ E14(x) - P34(x,y) ⇒ E18(y) - P34(x,y) ⇒ P140(x,y)
domain: E14 Condition Assessment
label: P34 a porté sur @fr
label: P34 betraf @de
label: P34 interessada @pt
label: P34 αφορούσε σε @el
label: P34 имел дело с @ru
label: P34 已评估 @zh
range: E18 Physical Thing
sub property of: P140 assigned attribute to
inverse of: P34 was assessed by
notation: P34

E15 Identifier Assignment
type: Class
type: NamedIndividual
comment: Scope note: This class comprises activities that result in the allocation of an identifier to an instance of E1 CRM Entity. An instance of E15 Identifier Assignment may include the creation of the identifier from multiple constituents, which themselves may be instances of E41 Appellation. The syntax and kinds of constituents to be used may be declared in a rule constituting an instance of E29 Design or Procedure. Examples of such identifiers include Find Numbers, Inventory Numbers, uniform titles in the sense of librarianship and Digital Object Identifiers (DOI). Documenting the act of identifier assignment and deassignment is especially useful when objects change custody or the identification system of an organization is changed. In order to keep track of the identity of things in such cases, it is important to document by whom, when, and for what purpose an identifier is assigned to an item. The fact that an identifier is a preferred one for an organisation can be expressed by using the property E1 CRM Entity. P48 has preferred identifier (is preferred identifier of): E42 Identifier. It can better be expressed in a context independent form by assigning a suitable E55 Type, such as “preferred identifier assignment”, to the respective instance of E15 Identifier Assignment through the P2 has type (is type of) property. Examples: - replacement of the inventory number TA959a by GE34604 for a 17(th) century lamentation cloth at the Museum Benaki, Athens - assigning the author and uniform title heading “Goethe, Johann Wolfgang von, 1749-1832. Faust. 1. Theil.” to a work - on 1(st) June 2001, assigning the personal name heading “Guillaume, de Machaut, ca. 1300-1377” to Guillaume de Machaut (Kelly, 2014) In First Order Logic: - E15(x) ⇒ E13(x)
label: E15 Assignation d’identifiant @fr
label: E15 Atribuição de Identificador @pt
label: E15 Kennzeichenzuweisung @de
label: E15 Απόδοση Αναγνωριστικού @el
label: E15 Назначение Идентификатора @ru
label: E15 标识符赋值 @zh
subclass of: E13 Attribute Assignment
subclass of: Restriction
  on property: P37 assigned
  some values from: E42 Identifier
notation: E15

E93 Presence
type: Class
type: NamedIndividual
comment: Scope note: This class comprises instances of E92 Spacetime Volume, whose temporal extent has been chosen in order to determine the spatial extent of a phenomenon over the chosen time-span. Respective phenomena may, for instance, be historical events or periods, but can also be the diachronic extent and existence of physical things. In other words, instances of this class fix a slice of another instance of E92 Spacetime Volume in time. The temporal extent of an instance of E93 Presence typically is predetermined by the researcher so as to focus the investigation particularly on finding the spatial extent of the phenomenon by testing for its characteristic features. There are at least two basic directions such investigations might take. The investigation may wish to determine where something was during some time or it may wish to reconstruct the total passage of a phenomenon’s spacetime volume through an examination of discrete presences. Observation and measurement of features indicating the presence or absence of a phenomenon in some space allows for the progressive approximation of spatial extents through argumentation typically based on inclusion, exclusion and various overlaps. Examples: - the Roman Empire on 19(th) August AD 14 (Clare and Edwards, 1992) - Johann Joachim Winckelmann’s whereabouts in December 1775 (Leppmann, 1970) - Johann Joachim Winckelmann’s whereabouts from 19(th) November 1755 until 9(th) April 1768 (Leppmann, 1970) In First Order Logic: - E93(x) ⇒ E92(x)
label: E93 Présence @fr
subclass of: E92 Spacetime Volume
notation: E93

P152 is parent of
type: ObjectProperty
type: NamedIndividual
comment: Quantification of the inverse property: many to many, necessary (2,n:0,n) Scope note of the inverse property: This property associates an instance of E21 Person with another instance of E21 Person who plays the role of the first instance’s parent, regardless of whether the relationship is biological parenthood, assumed or pretended biological parenthood or an equivalent legal status of rights and obligations obtained by a social or legal act. This property is, among others, a shortcut of the fully developed paths from E21 Person through P98i was born, E67 Birth, P96 by mother to E21 Person, and from E21 Person through P98i was born, E67 Birth, P97 from father to E21 Person. This property is not transitive. This property is irreflexive. Examples of the inverse property: - Gaius Octavius (E21) has parent Julius Caesar (E21). (Bleicken & Bell, 2015) - Steve Jobs (E21) has parent Joanne Simpson (E21). [Biological mother] (Isaacson, 2011) - Steve Jobs (E21) has parent Clara Jobs (E21). [Adoption mother] (Isaacson, 2011) In First Order Logic of the inverse property: - P152(x,y) ⇒ E21(x) - P152(x,y) ⇒ E21(y) - P152(x,y) ⇐ (∃z) [E67(z) ˄ P98i(x,z) ˄ P96(z,y)] - P152(x,y) ⇐ (∃z) [E67(z) ˄ P98i(x,z) ˄ P97(z,y)] - ¬P152(x,x)
domain: E21 Person
label: P152 est le parent de @fr
range: E21 Person
notation: P152i

P23 transferred title from
type: ObjectProperty
type: NamedIndividual
comment: Quantification: many to many (0,n:0,n) Scope note: This property identifies the instance(s) of E39 Actor who relinquish legal ownership as the result of an instance of E8 Acquisition. The property will typically be used to describe a person donating or selling an object to a museum. In reality, the title is either transferred to or from someone, or both. Examples: - The acquisition of the Amoudruz collection by the Geneva Ethnography Museum (E8) transferred title from the Heirs of Amoudruz (E74). In First Order Logic: - P23(x,y) ⇒ E8(x) - P23(x,y) ⇒ E39(y) - P23(x,y) ⇒ P14(x,y)
domain: E8 Acquisition
label: P23 a transféré le titre de propriété de @fr
label: P23 transferiu os direitos de propriedade de @pt
label: P23 übertrug Besitztitel von @de
label: P23 μετεβίβασε τον τίτλο από @el
label: P23 передал право собственности от @ru
label: P23 转移所有权自 @zh
range: E39 Actor
sub property of: P14 carried out by
inverse of: P23 surrendered title through
notation: P23

P62 is depicted by
type: ObjectProperty
type: NamedIndividual
comment: Quantification of the inverse property: many to many (0,n:0,n) Scope note of the inverse property: This property identifies something that is depicted by an instance of E24 Physical Human-Made Thing. Depicting is meant in the sense that an instance of E24 Physical Human-Made Thing intentionally shows, through its optical qualities or form, a representation of the entity depicted. Photographs are by default regarded as being intentional in this sense. Anything that is designed to change the properties of the depiction, such as an e-book reader, is specifically excluded. The property does not pertain to inscriptions or any other information encoding. This property is a shortcut of the more fully developed path from E24 Physical Human-Made Thing through P65 shows visual item, E36 Visual Item, P138 represents to E1 CRM Entity. P62.1 mode of depiction allows the nature of the depiction to be refined. Examples of the inverse property: - The painting “La Liberté guidant le peuple” by Eugène Delacroix (E22) depicts the French “July Revolution” of 1830 (E7). (Delacroix, 1982) - The 20 pence coin held by the Department of Coins and Medals of the British Museum under registration number 2006,1101.126 (E22) depicts Queen Elizabeth II (E21) mode of depiction Profile (E55). In First Order Logic of the inverse property: - P62(x,y) ⇒ E24(x) - P62(x,y) ⇒ E1(y) - P62(x,y,z) ⇒ [P62(x,y) ∧ E55(z)] - P62(x,y) ⇐ (∃z) [E36(z) ˄ P65(x,z) ˄ P138(z,y)]
domain: E1 CRM Entity
label: P62 est illustré par @fr
label: P62 wird abgebildet durch @de
label: P62 é retratada por @pt
label: P62 απεικονίζεται σε @el
label: P62 описан посредством @ru
label: P62 被描绘 @zh
range: E24 Physical Human-Made Thing
notation: P62i

P92 was brought into existence by
type: ObjectProperty
type: NamedIndividual
comment: Quantification of the inverse property: one to many, necessary, dependent (1,n:1,1) Scope note of the inverse property: This property links an instance of E63 Beginning of Existence to the instance of E77 Persistent Item brought into existence by it. It allows a “start” to be attached to any instance of E77 Persistent Item being documented, i.e., as instances of E70 Thing, E72 Legal Object, E39 Actor, E41 Appellation and E55 Type. Examples of the inverse property: - The birth of Mozart (E67) brought into existence Mozart (E21). (Deutsch, 1965) In First Order Logic of the inverse property: - P92(x,y) ⇒ E63(x) - P92(x,y) ⇒ E77(y) - P92(x,y) ⇒ P12(x,y)
domain: E77 Persistent Item
label: P92 a commencé à exister par @fr
label: P92 passou a existir por @pt
label: P92 wurde in Existenz gebracht durch @de
label: P92 γεννήθηκε από @el
label: P92 был создан посредством @ru
label: P92 使导致存在 @zh
range: E63 Beginning of Existence
sub property of: P12 was present at
notation: P92i

P68 foresees use of
type: ObjectProperty
type: NamedIndividual
comment: Quantification: many to many (0,n:0,n) Scope note: This property identifies an instance of E57 Material foreseen to be used by an instance of E29 Design or Procedure. E29 Designs and procedures commonly foresee the use of particular instances of E57 Material. The fabrication of adobe bricks, for example, requires straw, clay and water. This property enables this to be documented. This property is not intended for the documentation of instances of E57 Materials that were used on a particular occasion when an instance of E29 Design or Procedure was executed. Examples: - The procedure for soda glass manufacture (E29) foresees use of soda (E57). (Brooks, 1973) In First Order Logic: - P68(x,y) ⇒ E29(x) - P68(x,y) ⇒ E57(y) - P68(x,y) ⇒ P67(x,y)
domain: E29 Design or Procedure
label: P68 normalmente emprega @pt
label: P68 prévoit l'usage de @fr
label: P68 sieht den Gebrauch vor von @de
label: P68 συνήθως χρησιμοποιεί @el
label: P68 обычно применяет @ru
label: P68 预知使用 @zh
range: E57 Material
sub property of: P67 refers to
inverse of: P68 use foreseen by
notation: P68

P140 assigned attribute to
type: ObjectProperty
type: NamedIndividual
comment: Quantification: many to many (0,n:0,n) Scope note: This property associates an instance of E13 Attribute Assignment with the instance of E1 CRM Entity about which it made an attribution. The instance of E1 CRM Entity plays the role of the domain of the attribution. The kind of attribution made should be documented using P177 assigned property of type (is type of property assigned). Examples: - The Current Ownership Assessment of Martin Doerr’s silver cup February 1997 (E13) assigned attribute to Martin Doerr’s silver cup (E22). (fictitious) - The Identifier Assignment on 1(st) June 1997 of the silver cup donated by Martin Doerr (E15) assigned attribute to silver cup 232 (E22). (fictitious) - The examination of MS Sinai Greek 418 (E13) assigned attribute to MS Sinai Greek 418 (E22). (Honey and Pickwoad, 2010) In First Order Logic: - P140(x,y) ⇒ E13(x) - P140(x,y) ⇒ E1(y)
domain: E13 Attribute Assignment
label: P140 a assigné l’attribut à @fr
label: P140 atribuiu atributo para @pt
label: P140 wies Merkmal zu @de
label: P140 απέδωσε ιδιότητα σε @el
label: P140 присвоил атрибут для @ru
label: P140 分配属性于 @zh
range: E1 CRM Entity
inverse of: P140 was attributed by
notation: P140

P51 has former or current owner
type: ObjectProperty
type: NamedIndividual
comment: Quantification: many to many (0,n:0,n) Scope note: This property identifies an instance of E39 Actor that is or had been the legal owner (i.e. title holder) of an instance of E18 Physical Thing at some time. The distinction with P52 has current owner (is current owner of) is that P51 has former or current owner (is former or current owner of) does not indicate whether the specified owners are current. This property is a shortcut for the more detailed path from E18 Physical Thing through P24i changed ownership through, E8 Acquisition, P23 transferred title from, or P22 transferred title to to E39 Actor. Examples: - The paintings from the Iveagh Bequest (E78) has former or current owner Lord Iveagh (E21). (Bryant, 1990) In First Order Logic: - P51(x,y) ⇒ E18(x) - P51(x,y) ⇒ E39(y) - P51(x,y) ⇐ (∃z) [E8(z) ˄ P24i(x,z) ˄ [P23(z,y) ˅ P22(z,y) ]]
domain: E18 Physical Thing
label: P51 a pour propriétaire actuel ou antérieur @fr
label: P51 hat früheren oder derzeitigen Besitzer @de
label: P51 é ou foi propriedade de @pt
label: P51 έχει ή είχε ιδιοκτήτη @el
label: P51 имеет бывшего или текущего владельца @ru
label: P51 有以往或当前所有者 @zh
range: E39 Actor
inverse of: P51 is former or current owner of
notation: P51

P67 is referred to by
type: ObjectProperty
type: NamedIndividual
comment: Quantification of the inverse property: many to many (0,n:0,n) Scope note of the inverse property: This property documents that an instance of E89 Propositional Object makes a statement about an instance of E1 CRM Entity. P67 refers to (is referred to by) has the P67.1 has type link to an instance of E55 Type. This is intended to allow a more detailed description of the type of reference. This differs from P129 is about (is subject of), which describes the primary subject or subjects of the instance of E89 Propositional Object. Examples of the inverse property: - The eBay auction listing of 4(th) July 2002 (E73) refers to silver cup 232 (E22) has type item for sale (E55). (fictitious) In First Order Logic of the inverse property: - P67(x,y) ⇒ E89(x) - P67(x,y) ⇒ E1(y) - P67(x,y,z) ⇒ [P67(x,y) ∧ E55(z)]
domain: E1 CRM Entity
label: P67 fait l'objet d'un renvoi par @fr
label: P67 wird angeführt von @de
label: P67 é referenciado por @pt
label: P67 αναφέρεται από @el
label: P67 имеет ссылку на себя от @ru
label: P67 被涉及 @zh
range: E89 Propositional Object
notation: P67i

P108 was produced by
type: ObjectProperty
type: NamedIndividual
comment: Quantification of the inverse property: one to many, necessary, dependent (1,n:1,1) Scope note of the inverse property: This property identifies the instance of E24 Physical Human-Made Thing that came into existence as a result of the instance of E12 Production. The identity of an instance of E24 Physical Human-Made Thing is not defined by its matter, but by its existence as a subject of documentation. An E12 Production can result in the creation of multiple instances of E24 Physical Human-Made Thing. Examples of the inverse property: - The building of Rome (E12) has produced the Colosseum (E24). (Hopkins & Beard, 2011) In First Order Logic of the inverse property: - P108(x,y) ⇒ E12(x) - P108(x,y) ⇒ E24(y) - P108(x,y) ⇒ P31(x,y) - P108(x,y) ⇒ P92(x,y)
domain: E24 Physical Human-Made Thing
label: P108 a été produit par @fr
label: P108 foi produzido por @pt
label: P108 wurde hergestellt durch @de
label: P108 παρήχθη από @el
label: P108 был произведен посредством @ru
label: P108 被产生 @zh
range: E12 Production
sub property of: P31 was modified by
sub property of: P92 was brought into existence by
notation: P108i

P41 was classified by
type: ObjectProperty
type: NamedIndividual
comment: Quantification of the inverse property: many to one, necessary (1,1:0,n) Scope note of the inverse property: This property records the item to which a type was assigned in an E17 Type Assignment activity. Any instance of a CIDOC CRM entity may be assigned a type through type assignment. Type assignment events allow a more detailed path from E1 CRM Entity through P41i was classified by, E17 Type Assignment, P42 assigned, to E55 Type for assigning types to objects compared to the shortcut offered by P2 has type (is type of). Examples of the inverse property: - The classification of silver cup 232 on 31(st) August 1997 (E17) classified silver cup 232 (E22). (fictitious) In First Order Logic of the inverse property: - P41(x,y) ⇒ E17(x) - P41(x,y) ⇒ E1(y) - P41(x,y) ⇒ P140(x,y)
domain: E1 CRM Entity
label: P41 a été classifié par @fr
label: P41 foi classificada por @pt
label: P41 wurde klassifiziert durch @de
label: P41 χαρακτηρίσθηκε από @el
label: P41 был классифицирован посредством @ru
label: P41 被分类 @zh
range: E17 Type Assignment
sub property of: P140 was attributed by
notation: P41i

P182 starts after or with the end of
type: ObjectProperty
type: NamedIndividual
comment: Quantification of the inverse property: many to many (0,n:0,n) Scope note of the inverse property: This property specifies that the temporal extent of the domain instance A of E2 Temporal Entity ends before or simultaneously with the start of the temporal extent of the range instance B of E2 Temporal Entity. In other words, if A = [A(start), A(end)] and B = [B(start), B(end)], it means A(end) ≤ B(start) is true. This property is part of the set of temporal primitives P173 – P176, P182 – P185. This property corresponds to a disjunction (logical OR) of the following Allen temporal relations (Allen, 1983): {before, meets}. This property is transitive. This property is asymmetric. https://cidoc-crm.org/html/version_images/images_7.1.3/image_09.png Figure 16: Temporal entity A ends before or with the start of temporal entity B. Here A is longer than B https://cidoc-crm.org/html/version_images/images_7.1.3/image_10.png Figure 17: Temporal entity A ends before or with the start of temporal entity B. Here A is shorter than B Examples of the inverse property: - Lerna III (E4) ends before or with the start of Lerna IV (E4). [“The site at Lerna probably was not left uninhabited for long after the destruction of the House of the Tiles and the raising of the tumulus. If there was a gap corresponding to the earliest stage of EH III in the Argolid, as has been suggested by some (see, e.g., Manning 1995: 55–60), it was a brief one. In Rutter’s view, the short life of the Fourth Settlement began ca. 2200/2150 b.c. and ended ca. 2050/2000 b.c.”] (Banks & Reese, 2013) - The use of LH I graves of Krisa in Phocis (E4) ends before or with the start of LH III phase of reuse of the graves of Krisa in Phocis (E4). [“…a possible hiatus in the occupation of certain sites such as the settlement of Krisa in Phocis, which was well occupied in the MH and LHIII periods. LHIIB pottery from this settlement has already been identified, but no certain example of LHIIA pottery.”] (Phialon 2018) In Firs…
domain: E2 Temporal Entity
label: P182 commence après ou au moment de la fin de @fr
range: E2 Temporal Entity
sub property of: P176 starts after the start of
sub property of: P185 ends after the end of
notation: P182i

P33 used specific technique
type: ObjectProperty
type: NamedIndividual
comment: Quantification: many to many (0,n:0,n) Scope note: This property identifies a specific instance of E29 Design or Procedure in order to carry out an instance of E7 Activity or parts of it. The property differs from P32 used general technique (was technique of) in that P33 refers to an instance of E29 Design or Procedure, which is a concrete information object in its own right rather than simply being a term or a method known by tradition. Typical examples would include intervention plans for conservation or the construction plans of a building. Examples: - The ornamentation of silver cup 232 (E11) used specific technique ‘Instructions for golden chase work by A N Other’ (E29). (fictitious) - The rebuilding of the German Reichstag in Berlin (E11) used specific technique Architectural plans by Foster and Partners (E29). (Foster, 2000) In First Order Logic: - P33(x,y) ⇒ E7(x) - P33(x,y) ⇒ E29(y) - P33(x,y) ⇒ P16(x,y)
domain: E7 Activity
domain: MFN94 Longitude and Latitude
label: P33 a mobilisé comme technique spécifique @fr
label: P33 benutzte das bestimmte Verfahren @de
label: P33 usou técnica específica @pt
label: P33 χρησιμοποίησε συγκεκριμένη τεχνική @el
label: P33 использовал особую технику @ru
label: P33 使用特定技术 @zh
range: E29 Design or Procedure
sub property of: P16 used specific object
inverse of: P33 was used by
notation: P33

P197 was partially covered by
type: ObjectProperty
type: NamedIndividual
comment: Quantification of the inverse property: many to many (0,n:0,n) Scope note of the inverse property: This property associates an instance of E93 Presence with an instance of E53 Place that geometrically overlaps with the spatial projection of the respective instance of E93 Presence. A use case of this property is to state through which places an object or an instance of E21 Person has or was moved within a given time-span. It may also be used to describe a partial or complete, temporary or permanent extension of the spatial extent of some realm into a neighbouring region during a known time-span. It may also be used to describe a partial or complete, temporary or permanent extension of the spatial extent of some realm into a neighbouring region during a known time-span. This property is a shortcut of the more fully developed path from E93 Presence through P161 has spatial projection, E53 Place, P121 overlaps with, to E53 Place. Examples of the inverse property: - Johann Joachim Winckelmann’s whereabouts from 19(th) November 1755 until 9(th) April 1768 (E93) covered parts of Paestum, Italy (E53). (Wiencke, 1998) - The Byzantine Empire 1013 AD (E93) covered parts of The Italian Peninsula (E53). (Browning, 1980) In First Order Logic of the inverse property: - P197(x,y) ⇒ E93(x) - P197(x,y) ⇒ E53(y)
domain: E53 Place
label: P197 a été partiellement couvert par @fr
range: E93 Presence
notation: P197i

P54 is current permanent location of
type: ObjectProperty
type: NamedIndividual
comment: Quantification of the inverse property: many to one (0,1:0,n) Scope note of the inverse property: This property records the foreseen permanent location of an instance of E19 Physical Object at the time of validity of the record or database containing the statement that uses this property. P54 has current permanent location (is current permanent location of) is similar to P55 has current location (currently holds). However, it indicates the E53 Place currently reserved for an object, such as the permanent storage location or a permanent exhibit location. The object may be temporarily removed from the permanent location, for example when used in temporary exhibitions or loaned to another institution. The object may never actually be located at its permanent location. Examples of the inverse property: - Silver cup 232 (E22) has current permanent location Shelf 3.1, Store 2, Museum of Oxford (E53). (fictitious) In First Order Logic of the inverse property: - P54(x,y) ⇒ E19(x) - P54(x,y) ⇒ E53(y)
domain: E53 Place
label: P54 est actuellement la location fixe de @fr
label: P54 ist derzeitiger permanenter Standort von @de
label: P54 é localização permanente de @pt
label: P54 είναι μόνιμη θέση του/της @el
label: P54 является текущим постоянным местоположением для @ru
label: P54 是当前永久位置 @zh
range: E19 Physical Object
notation: P54i

E14 Condition Assessment
type: Class
type: NamedIndividual
comment: Scope note: This class describes the act of assessing the state of preservation of an object during a particular period. The condition assessment may be carried out by inspection, measurement, or through historical research. This class is used to document circumstances of the respective assessment that is relevant to interpret its quality at a later stage, or to continue research on related documents. Examples: - last year’s inspection of humidity damage to the frescos in the St. George chapel in our village (fictitious) - the condition assessment of the endband cores of MS Sinai Greek 418 by Nicholas Pickwoad in November 2003 (Honey & Pickwoad, 2010) - the condition assessment of the cover of MS Sinai Greek 418 by Nicholas Pickwoad in November 2003 (Honey & Pickwoad, 2010) In First Order Logic: - E14(x) ⇒ E13(x)
label: E14 Avaliação do Estado Material @pt
label: E14 Zustandsfeststellung @de
label: E14 Évaluation d’état matériel @fr
label: E14 Εκτίμηση Κατάστασης @el
label: E14 Оценка Состояния @ru
label: E14 状态评估 @zh
subclass of: E13 Attribute Assignment
subclass of: Restriction
  on property: P34 concerned
  some values from: E18 Physical Thing
subclass of: Restriction
  min cardinality: 1
  on property: P35 has identified
notation: E14

P74 is current or former residence of
type: ObjectProperty
type: NamedIndividual
comment: Quantification of the inverse property: many to many (0,n:0,n) Scope note of the inverse property: This property describes the current or former place of residence (an instance of E53 Place) of an instance of E39 Actor. The residence may be either the place where the actor resides, or a legally registered address of any kind. Examples of the inverse property: - Queen Elizabeth II (E39) has current or former residence Buckingham Palace (E53). (Robinson, 2000) In First Order Logic of the inverse property: - P74(x,y) ⇒ E39(x) - P74(x,y) ⇒ E53(y)
domain: E53 Place
label: P74 est la résidence actuelle ou antérieure de @fr
label: P74 ist derzeitiger oder früherer Sitz von @de
label: P74 é ou foi residência de @pt
label: P74 είναι ή ήταν κατοικία του/της @el
label: P74 является текущим или бывшим местом жительства для @ru
label: P74 是当前或曾经居住地 @zh
range: E39 Actor
notation: P74i

P145 left by
type: ObjectProperty
type: NamedIndividual
comment: Quantification of the inverse property: many to many, necessary (1,n:0,n) Scope note of the inverse property: This property identifies the instance of E39 Actor that leaves an instance of E74 Group through an instance of E86 Leaving. Examples of the inverse property: - The end of Sir Isaac Newton’s duty as Member of Parliament for the University of Cambridge to the Convention Parliament in 1702 (E86) separated Sir Isaac Newton (E21). (Iliffe, 2013) - George Washington’s leaving office in 1797 (E86) separated George Washington (E21). (Unger, 2015) - The implementation of the treaty regulating the termination of Greenland membership in EU between EU, Denmark and Greenland 1(st) February 1985 (E86) separated Greenland (E74). In First Order Logic of the inverse property: - P145(x,y) ⇒ E86(x) - P145(x,y) ⇒ E39(y) - P145(x,y) ⇒ P11(x,y)
domain: E39 Actor
label: P145 est dissocié par @fr
label: P145 wurde entlassen durch @de
label: P145 留下 @zh
range: E86 Leaving
sub property of: P11 participated in
notation: P145i

E35 Title
type: Class
type: NamedIndividual
comment: Scope note: This class comprises the textual strings that within a cultural context can be clearly identified as titles due to their form. Being a subclass of E41 Appellation, E35 Title can only be used when such a string is actually used as a title of a work, such as a text, an artwork, or a piece of music. Titles are proper noun phrases or verbal phrases, and should not be confused with generic object names such as “chair”, “painting”, or “book” (the latter are common nouns that stand for instances of E55 Type). Titles may be assigned by the creator of the work itself, or by a social group. This class also comprises the translations of titles that are used as surrogates for the original titles in different social contexts. Examples: - “The Merchant of Venice” (McCullough, 2005) - “Mona Lisa” (Mohen, Menu and Mottin, 2006) - “La Pie” (Bortolatto, 1981) - “Lucy in the Sky with Diamonds” (Lennon, 1967) In First Order Logic: - E35(x) ⇒ E33(x) - E35(x) ⇒ E41(x)
label: E35 Titel @de
label: E35 Titre @fr
label: E35 Título @pt
label: E35 Τίτλος @el
label: E35 Заголовок @ru
label: E35 题名 @zh
subclass of: E33 Linguistic Object
subclass of: E41 Appellation
notation: E35

P169 spacetime volume is defined by
type: DatatypeProperty
type: NamedIndividual
comment: Quantification of the inverse property: many to one, necessary (1,1:0,n) Scope note of the inverse property: This property associates an instance of E95 Spacetime Primitive with the instance of E92 Spacetime Volume it defines. Examples of the inverse property: - {40°30'23"N 21°14'53"E, 40°31'40"N 21°16'43"E, 200BC-2020AD} (E95) defines spacetime volume Martin’s spatiotemporal enclosure 2020 for the evolution of the settlement of today’s city of Kastoria, Greece, since its conquest by the Romans (E92). [A square covering the current built settlement structure of Kastoria, Greece, through the years 200BC to 2020AD, which includes the extents of earlier phases of the city] In First Order Logic of the inverse property: - P169(x,y) ⇒ E95(x) - P169(x,y) ⇒ E92(y) - P169(x,y) ⇒ P1i(x,y)
domain: E92 Spacetime Volume
label: P169 volume spatio-temporel défini par @fr
notation: P169i

P10 contains
type: ObjectProperty
type: TransitiveProperty
type: NamedIndividual
comment: Quantification of the inverse property: many to many, necessary, dependent (1,n:1,n) Scope note of the inverse property: This property associates an instance of E92 Spacetime Volume with another instance of E92 Spacetime Volume that falls within the latter. In other words, all points in the former are also points in the latter. This property is transitive and reflexive. Examples of the inverse property: - The Great Plague (E4) falls within The Gothic period (E4). (Porter, 2009) In First Order Logic of the inverse property: - P10(x,y) ⇒ E92(x) - P10(x,y) ⇒ E92(y) - P10(x,y) ⇒ P132(x,y) - P10(x,y) ∧ P10(y,z)] ⇒ P10(x,z) - P10(x,x)
domain: E92 Spacetime Volume
label: P10 contient @fr
label: P10 contém @pt
label: P10 enthält @de
label: P10 περιλαμβάνει @el
label: P10 содержит @ru
label: P10 包含 @zh
range: E92 Spacetime Volume
sub property of: P132 spatiotemporally overlaps with
notation: P10i

P31 was modified by
type: ObjectProperty
type: NamedIndividual
comment: Quantification of the inverse property: many to many, necessary (1,n:0,n) Scope note of the inverse property: This property identifies the instance of E18 Physical Thing modified in an instance of E11 Modification. Examples of the inverse property: - The rebuilding of the German Reichstag in Berlin (E11) has modified the Reichstag in Berlin (E24). (Foster, 2000) In First Order Logic of the inverse property: - P31(x,y) ⇒ E11(x) - P31(x,y) ⇒ E18(y) - P31(x,y) ⇒ P12(x,y)
domain: E18 Physical Thing
label: P31 a été modifié par @fr
label: P31 foi modificada por @pt
label: P31 wurde verändert durch @de
label: P31 τροποποιήθηκε από @el
label: P31 был изменен посредством @ru
label: P31 被更改 @zh
range: E11 Modification
sub property of: P12 was present at
notation: P31i

P197 covered parts of
type: ObjectProperty
type: NamedIndividual
comment: Quantification: many to many (0,n:0,n) Scope note: This property associates an instance of E93 Presence with an instance of E53 Place that geometrically overlaps with the spatial projection of the respective instance of E93 Presence. A use case of this property is to state through which places an object or an instance of E21 Person has or was moved within a given time-span. It may also be used to describe a partial or complete, temporary or permanent extension of the spatial extent of some realm into a neighbouring region during a known time-span. It may also be used to describe a partial or complete, temporary or permanent extension of the spatial extent of some realm into a neighbouring region during a known time-span. This property is a shortcut of the more fully developed path from E93 Presence through P161 has spatial projection, E53 Place, P121 overlaps with, to E53 Place. Examples: - Johann Joachim Winckelmann’s whereabouts from 19(th) November 1755 until 9(th) April 1768 (E93) covered parts of Paestum, Italy (E53). (Wiencke, 1998) - The Byzantine Empire 1013 AD (E93) covered parts of The Italian Peninsula (E53). (Browning, 1980) In First Order Logic: - P197(x,y) ⇒ E93(x) - P197(x,y) ⇒ E53(y)
domain: E93 Presence
label: P197 a couvert des parties de @fr
range: E53 Place
inverse of: P197 was partially covered by
notation: P197

P13 was destroyed by
type: ObjectProperty
type: NamedIndividual
comment: Quantification of the inverse property: one to many, necessary (1,n:0,1) Scope note of the inverse property: This property links an instance of E6 Destruction to an instance of E18 Physical Thing that has been destroyed by it. Destruction implies the end of an item’s life as a subject of cultural documentation – the physical matter of which the item was composed may in fact continue to exist. An instance of E6 Destruction may be contiguous with an instance of E12 Production that brings into existence a derived object composed partly of matter from the destroyed object. Examples of the inverse property: - The Tay Bridge Disaster (E6) destroyed the Tay Bridge (E22). (Thomas, 1972) In First Order Logic of the inverse property: - P13(x,y) ⇒ E6 (x) - P13(x,y) ⇒ E18(y) - P13(x,y) ⇒ P93(x,y)
domain: E18 Physical Thing
label: P13 a été détruit par @fr
label: P13 foi destruído por @pt
label: P13 wurde zerstört durch @de
label: P13 καταστράφηκε από @el
label: P13 был уничтожен посредством @ru
label: P13 被破坏 @zh
range: E6 Destruction
sub property of: P93 was taken out of existence by
notation: P13i

P113 removed
type: ObjectProperty
type: NamedIndividual
comment: Quantification: many to many, necessary (1,n:0,n) Scope note: This property identifies the instance of E18 Physical Thing that is removed during an instance of E80 Part Removal activity. Examples: - The opening of the coffin of Tut-Ankh-Amun (E80) removed The mummy of Tut-Ankh-Amun (E20, E22). (Carter, 2014) In First Order Logic: - P113(x,y) ⇒ E80(x) - P113(x,y) ⇒ E18(y) - P113(x,y) ⇒ P12(x,y)
domain: E80 Part Removal
label: P113 a retiré @fr
label: P113 entfernte @de
label: P113 removeu @pt
label: P113 αφαίρεσε @el
label: P113 удален @ru
label: P113 去除了 @zh
range: E18 Physical Thing
sub property of: P12 occurred in the presence of
inverse of: P113 was removed by
notation: P113

E29 Design or Procedure
type: Class
type: NamedIndividual
comment: Scope note: This class comprises documented plans for the execution of actions in order to achieve a result of a specific quality, form, or contents. In particular, it comprises plans for deliberate human activities that may result in new instances of E71 Human-Made Thing or for shaping or guiding the execution of an instance of E7 Activity. Instances of E29 Design or Procedure can be structured in parts and sequences or depend on others. This is modelled using P69 has association with (is associated with): E29 Design or Procedure. Designs or procedures can be seen as one of the following: 1. A schema for the activities it describes 2. A schema of the products that result from their application 3. An independent intellectual product that may have never been applied, such as Leonardo da Vinci’s famous plans for flying machines Because designs or procedures may never be applied or only partially executed, the CIDOC CRM models a loose relationship between the plan and the respective product. Examples: - the ISO standardisation procedure - the musical notation for Beethoven’s “Ode to Joy” (Kershaw, 1999) - the architectural drawings for the Kölner Dom (Cologne Cathedral) in Cologne, Germany (Wolff, 1999) - the drawing found on Folio 860 of the Codex Atlanticus from Leonardo da Vinci, 1486 to 1490, kept in the Biblioteca Ambrosiana in Milan In First Order Logic: - E29(x) ⇒ E73(x)
label: E29 Conceptualisation ou procédure @fr
label: E29 Entwurf oder Verfahren @de
label: E29 Projeto ou Procedimento @pt
label: E29 Σχέδιο @el
label: E29 Проект или Процедура @ru
label: E29 设计或程序 @zh
subclass of: E73 Information Object
notation: E29

P4 is time-span of
type: ObjectProperty
type: NamedIndividual
comment: Quantification of the inverse property: many to one, necessary (1,1:0,n) Scope note of the inverse property: This property associates an instance of E2 Temporal Entity with the instance of E52 Time-Span during which it was on-going. The associated instance of E52 Time-Span is understood as the real time-span during which the phenomena making up the temporal entity instance were active. More than one instance of E2 Temporal Entity may share a common instance of E52 Time-Span only if they come into being and end being due to identical declarations or events. Examples of the inverse property: - The Yalta Conference (E7) has time-span Yalta Conference time-span (E52). (Harbutt, 2010) In First Order Logic of the inverse property: - P4(x,y) ⇒ E2(x) - P4(x,y) ⇒ E52(y)
domain: E52 Time-Span
label: P4 est l’intervalle temporel de @fr
label: P4 ist Zeitspanne von @de
label: P4 é o período de tempo de @pt
label: P4 είναι χρονικό διάστημα του/της @el
label: P4 является временным отрезком для @ru
label: P4 是时段 @zh
range: E2 Temporal Entity
notation: P4i

P21 had general purpose
type: ObjectProperty
type: NamedIndividual
comment: Quantification: many to many (0,n:0,n) Scope note: This property describes an intentional relationship between an instance of E7 Activity and some general goal or purpose, described as an instance of E55 Type. This may involve activities intended as preparation for some type of activity or event. P21 had general purpose (was purpose of) differs from P20 had specific purpose (was purpose of in that no specific event is implied as the purpose. Examples: - Van Eyck’s pigment grinding (E7) had general purpose painting (E55). (Borchert, 2008) - The setting of trap 2742 on 17(th) May 1874 (E7) had general purpose catching moose (E55). [activity type] (fictitious) - The construction of the Berlin Wall starting 13(th) August 1961 (E12) had general purpose preventing emigration (E55). (History.com Editors, 2020) - The reinforcement of the Mexico-United States barrier between the United States of America and Mexico in Fall 2019 (E11) had general purpose preventing immigration (E55). - The rebuilding of the city walls of Heraklion by the Venetian rulers starting in 1462 (E12) had general purpose preventing conquest by enemy (E55). (YouIngGreece.com, 2020) - The building of the seawall in Hamamatsu, Shizuoka, Japan between 2014 and 2020 (E12) had general purpose preventing inland flooding by tsunami (E55). In First Order Logic: - P21(x,y) ⇒ E7(x) - P21(x,y) ⇒ E55(y)
domain: E7 Activity
label: P21 a eu pour finalité générale @fr
label: P21 hatte den allgemeinen Zweck @de
label: P21 tinha propósito geral @pt
label: P21 είχε γενικό σκοπό @el
label: P21 имел общую цель @ru
label: P21 有一般目的 @zh
range: E55 Type
inverse of: P21 was purpose of
notation: P21

E3 Condition State
type: Class
type: NamedIndividual
comment: Scope note: This class comprises the states of objects characterised by a certain condition over a time-span. An instance of this class describes the prevailing physical condition of any material object or feature during a specific instance of E52 Time-Span. In general, the time-span for which a certain condition can be asserted may be shorter than the real time-span, for which this condition held. The nature of that condition can be described using P2 has type. For example, the instance of E3 Condition State “condition of the SS Great Britain between 22(nd) September 1846 and 27(th) August 1847” can be characterized as an instance “wrecked” of E55 Type. Examples: - the "reconstructed" state of the “Amber Room” in Tsarskoje Selo from summer 2003 until now (Owen, 2009) - the "ruined" state of Peterhof Palace near Saint Petersburg from 1944 to 1946 (Maddox, 2015) - the state of my turkey in the oven at 14:30 on 25(th) December 2002 [P2 has type: E55 Type “still not cooked”] (fictitious) - the topography of the leaves of Sinai Printed Book 3234.2361 on the 10(th) July 2007 [described as: of type "cockled"] (fictitious) In First Order Logic: - E3(x) ⇒ E2(x)
label: E3 Estado Material @pt
label: E3 Zustandsphase @de
label: E3 État matériel @fr
label: E3 Κατάσταση @el
label: E3 Состояние @ru
label: E3 条件状态 @zh
subclass of: E2 Temporal Entity
subclass of: Restriction
  on property: P44 is condition of
  some values from: E18 Physical Thing
notation: E3

P156 is occupied by
type: ObjectProperty
type: NamedIndividual
comment: Quantification of the inverse property: many to one (0,1:0,n) Scope note of the inverse property: This property describes the largest volume in space, an instance of E53 Place, that an instance of E18 Physical Thing has occupied at any time during its existence, with respect to the reference space relative to the physical thing itself. This allows for describing the thing itself as a place that may contain other things, such as a box that may contain coins. In other words, it is the volume that contains all the points which the thing has covered at some time during its existence. The reference space for the associated place must be the one that is permanently at rest (P157 is at rest relative to) relative to the physical thing. For instances of E19 Physical Objects it is the one which is at rest relative to the object itself, i.e., which moves together with the object. For instances of E26 Physical Feature it is one which is at rest relative to the physical feature itself and the surrounding matter immediately connected to it. Therefore, there is a 1:1 relation between the instance E18 Physical Thing and the instance of E53 Place it occupies. We include in the occupied space the space filled by the matter of the physical thing and all its inner spaces. This property implies the fully developed path from E18 Physical Thing through P196 defines, E92 Spacetime Volume, P161 has spatial projection to E53 Place. However, in contrast to P156 occupies, the property P161 has spatial projection does not constrain the reference space of the referred instance of E53 Place. In contrast to P156 occupies, for the property P53 has former or current location the following holds: It does not constrain the reference space of the referred instance of E53 Place. It identifies a possibly wider instance of E53 Place at which a thing is or has been for some unspecified time-span. If the reference space of the referred instance of E53 Place is not at rest with respect to the physical thing …
domain: E53 Place
label: P156 est occupé par @fr
range: E18 Physical Thing
sub property of: P157 is at rest relative to
sub property of: P53 is former or current location of
notation: P156i

P144 joined with
type: ObjectProperty
type: NamedIndividual
comment: Quantification: many to many, necessary (1,n:0,n) Scope note: This property identifies the instance of E74 Group of which an instance of E39 Actor becomes a member through an instance of E85 Joining. Although a joining activity normally concerns only one instance of E74 Group, it is possible to imagine circumstances under which becoming member of one Group implies becoming member of another Group as well. Joining events allow for describing people becoming members of a group with a more detailed path from E74 Group through, P144i gained member by, E85 Joining, P143 joined, E39 Actor, compared to the shortcut offered by P107 has current or former member (is current or former member of). The property P144.1 kind of member can be used to specify the type of membership or the role the member has in the group. Examples: - The election of Sir Isaac Newton as Member of Parliament to the Convention Parliament of 1689 (E85) joined with the Convention Parliament (E74). (Iliffe, 2013) - The inauguration of Mikhail Sergeyevich Gorbachev as Leader of the Union of Soviet Socialist Republics (USSR) in 1985 (E85) joined with the office of Leader of the Union of Soviet Socialist Republics (USSR) (E74) kind of member President (E55). (Galeotti, 1997) - The implementation of the membership treaty 1(st) January 1973 between EU and Denmark (E85) joined with EU (E74). Properties: - P144.1 kind of member: E55 Type In First Order Logic: - P144(x,y) ⇒ E85(x) - P144(x,y)⇒ E74(y) - P144(x,y,z) ⇒ [P144(x,y) ∧ E55(z)] - P144(x,y) ⇒ P11(x,y)
domain: E85 Joining
label: P144 a fait adhérer à @fr
label: P144 verband mit @de
label: P144 加入 @zh
range: E74 Group
sub property of: P11 had participant
inverse of: P144 gained member by
notation: P144

E1 CRM Entity
type: Class
type: NamedIndividual
comment: Scope note: This class comprises all things in the universe of discourse of the CIDOC Conceptual Reference Model. It is an abstract concept providing for three general properties: - Identification by name or appellation, and in particular by a preferred identifier - Classification by type, allowing further refinement of the specific subclass to which an instance belongs - Attachment of free text and other unstructured data for the expression of anything not captured by formal properties All other classes within the CIDOC CRM are directly or indirectly specialisations of E1 CRM Entity. Examples: - the earthquake in Lisbon 1755 (E5) (Chester, 2001) In First Order Logic: - E1(x)
label: E1 CRM Entität @de
label: E1 CRM Сущность @ru
label: E1 CRM实体 @zh
label: E1 Entidade CRM @pt
label: E1 Entité CRM @fr
label: E1 Οντότητα CIDOC CRM @el
subclass of: Restriction
  max cardinality: 1
  on property: P48 has preferred identifier
notation: E1

P145 separated
type: ObjectProperty
type: NamedIndividual
comment: Quantification: many to many, necessary (1,n:0,n) Scope note: This property identifies the instance of E39 Actor that leaves an instance of E74 Group through an instance of E86 Leaving. Examples: - The end of Sir Isaac Newton’s duty as Member of Parliament for the University of Cambridge to the Convention Parliament in 1702 (E86) separated Sir Isaac Newton (E21). (Iliffe, 2013) - George Washington’s leaving office in 1797 (E86) separated George Washington (E21). (Unger, 2015) - The implementation of the treaty regulating the termination of Greenland membership in EU between EU, Denmark and Greenland 1(st) February 1985 (E86) separated Greenland (E74). In First Order Logic: - P145(x,y) ⇒ E86(x) - P145(x,y) ⇒ E39(y) - P145(x,y) ⇒ P11(x,y)
domain: E86 Leaving
label: P145 a dissocié @fr
label: P145 entließ @de
label: P145 离开 @zh
range: E39 Actor
sub property of: P11 had participant
inverse of: P145 left by
notation: P145

P99 dissolved
type: ObjectProperty
type: NamedIndividual
comment: Quantification: one to many, necessary (1,n:0,n) Scope note: This property associates the instance of E68 Dissolution with the instance of E74 Group that it disbanded. Examples: - The end of The Hole in the Wall Gang (E68) dissolved The Hole in the Wall Gang (E74). (Patterson, 1998) In First Order Logic: - P99(x,y) ⇒ E68(x) - P99(x,y) ⇒ E74(y) - P99(x,y) ⇒ P11(x,y) - P99(x,y) ⇒ P93(x,y)
domain: E68 Dissolution
label: P99 a dissous @fr
label: P99 dissolveu @pt
label: P99 löste auf @de
label: P99 διέλυσε @el
label: P99 распустил @ru
label: P99 解散了 @zh
range: E74 Group
sub property of: P11 had participant
sub property of: P93 took out of existence
inverse of: P99 was dissolved by
notation: P99

P56 is found on
type: ObjectProperty
type: NamedIndividual
comment: Quantification of the inverse property: one to many, dependent (0,n:1,1) Scope note of the inverse property: This property links an instance of E19 Physical Object to an instance of E26 Physical Feature that it bears. An instance of E26 Physical Feature can only exist on one object. One object may bear more than one E26 Physical Feature. An instance of E27 Site should be considered as an instance of E26 Physical Feature on the surface of the Earth. An instance B of E26 Physical Feature being a detail of the structure of another instance A of E26 Physical Feature can be linked to B by use of the property P46 is composed of (forms part of). This implies that the subfeature B is P56i is found on the same E19 Physical Object as A. This property is a shortcut. A more detailed representation can make use of the fully developed (i.e. indirect) path E19 Physical Object, through, P59 has section, E53 Place, P53i is former or current location of to E26 Physical Feature. Examples of the inverse property: - Silver cup 232 (E22) bears feature 32 mm scratch on silver cup 232 (E26). (fictitious) In First Order Logic of the inverse property: - P56(x,y) ⇒E19(x) - P56(x,y) ⇒ E26(y) - P56(x,y) ⇒ P46(x,y) - P56(x,y) ⇐ (∃z) [E53(z) ˄ P59(x,z) ˄ P53i(z,y)]
domain: E26 Physical Feature
label: P56 se trouve sur @fr
label: P56 wird gefunden auf @de
label: P56 é encontrada em @pt
label: P56 βρίσκεται σε @el
label: P56 найден на @ru
label: P56 发现于 @zh
range: E19 Physical Object
sub property of: P46 forms part of
notation: P56i

P59 is located on or within
type: ObjectProperty
type: NamedIndividual
comment: Quantification of the inverse property: many to many (0,n:0,n) Scope note of the inverse property: This property links an area, i.e., an instance of E53 Place to the instance of E18 Physical Thing upon which it is found. This area may either be identified by a name, or by a geometry in terms of a coordinate system adapted to the shape of the respective instance of E18 Physical Thing. Typically, names identifying sections of physical objects are composed of the name of a kind of part and the name of the object itself, such as “The poop deck of H.M.S. Victory”, which is composed of “poop deck” and “H.M.S. Victory”. Examples of the inverse property: - HMS Victory (E22) has section HMS Victory section B347.6 (E53). (Goodwin, 2015) In First Order Logic of the inverse property: - P59(x,y) ⇒ E18(x) - P59(x,y) ⇒ E53(y)
domain: E53 Place
label: P59 befindet sich auf oder in @de
label: P59 está localizada sobre ou dentro de @pt
label: P59 se situe sur ou dans @fr
label: P59 βρίσκεται σε ή εντός @el
label: P59 находится на или внутри @ru
label: P59 位于 @zh
range: E18 Physical Thing
sub property of: P157 is at rest relative to
notation: P59i

P7 took place at
type: ObjectProperty
type: NamedIndividual
comment: Quantification: many to many, necessary (1,n:0,n) Scope note: This property describes the spatial location of an instance of E4 Period. The related instance of E53 Place should be seen as a wider approximation of the geometric area within which the phenomena that characterise the period in question occurred, see below. P7 took place at (witnessed) does not convey any meaning other than spatial positioning (frequently on the surface of the earth). For example, the period “Révolution française” can be said to have taken place in “France in 1789”; the “Victorian” period may be said to have taken place in “Britain from 1837-1901” and its colonies, as well as other parts of Europe and North America. An instance of E4 Period can take place at multiple non-contiguous, non-overlapping locations. Any place where something happened includes the spatial projection of the happening given in the same geometric reference system. For instance, HMS Victory, as place of Lord Nelson's dying, includes the location of his body relative to the hull of HMS Victory at his time of death as the most precise location of his death. By the definition of P161 has spatial projection, an instance of E4 Period takes place on all its spatial projections to respective reference systems, that is, instances of E53 Place. Therefore, this property implies the more fully developed path from E4 Period through P161 has spatial projection, E53 Place, P89 falls within to E53 Place, where both places are defined in the same geometric reference system. The relation between an instance of E53 Place and its reference system can conveniently be documented via the property P157 is at rest relative to (provides reference space for). Something that has happened at a given place can also be considered to have happened at a smaller place within it: for example, it is reasonable to say Caesar’s murder took place in Rome, but also on the Forum Romanum, and more precisely in the Curia. It is characteristic for different …
domain: E4 Period
label: P7 a eu lieu dans @fr
label: P7 fand statt in @de
label: P7 ocorreu em @pt
label: P7 έλαβε χώρα σε @el
label: P7 совершался на @ru
label: P7 发生地在 @zh
range: E53 Place
inverse of: P7 witnessed
notation: P7

P93 took out of existence
type: ObjectProperty
type: NamedIndividual
comment: Quantification: one to many, necessary (1,n:0,1) Scope note: This property links an instance of E64 End of Existence to the instance of E77 Persistent Item taken out of existence by it. In the case of immaterial things, the instance of E64 End of Existence is considered to take place with the destruction of the last physical carrier. This allows an “end” to be attached to any instance of E77 Persistent Item being documented i.e. instances of E70 Thing, E72 Legal Object, E39 Actor, E41 Appellation, and E55 Type. For many instances of E77 Persistent Item we know the maximum life-span and can infer that they must have ended to exist. We assume in that case an instance of E64 End of Existence, which may be as unnoticeable as forgetting the secret knowledge by the last representative of some indigenous nation. Examples: - The death of Mozart (E69) took out of existence Mozart (E21). (Deutsch, 1965) In First Order Logic: - P93(x,y) ⇒ E64(x) - P93(x,y) ⇒ E77(y) - P93(x,y) ⇒ P12(x,y)
domain: E64 End of Existence
label: P93 a mis fin à l’existence de @fr
label: P93 beendete die Existenz von @de
label: P93 cessou a existência de @pt
label: P93 αναίρεσε @el
label: P93 положил конец существованию @ru
label: P93 结束存在的是 @zh
range: E77 Persistent Item
sub property of: P12 occurred in the presence of
inverse of: P93 was taken out of existence by
notation: P93

E72 Legal Object
type: Class
type: NamedIndividual
comment: Scope note: This class comprises those material or immaterial items to which instances of E30 Right, such as the right of ownership or use, can be applied. This is generally true for all instances of E18 Physical Thing. In the case of instances of E28 Conceptual Object, however, the identity of an instance of E28 Conceptual Object or the method of its use may be too ambiguous to reliably establish instances of E30 Right, as in the case of taxa and inspirations. Ownership of corporations is currently regarded as out of scope of the CIDOC CRM. Examples: - the Cullinan diamond (E19) (Scarratt and Shor, 2006) - definition of the CIDOC Conceptual Reference Model Version 5.0.4 (E73) (ISO 21127: 2014) In First Order Logic: - E72(x) ⇒ E70(x)
label: E72 Objet juridique @fr
label: E72 Objeto Jurídico @pt
label: E72 Rechtsobjekt @de
label: E72 Νομικό Αντικείμενο @el
label: E72 Объект Права @ru
label: E72 法律对象 @zh
subclass of: E70 Thing
subclass of: Restriction
  on property: P104 is subject to
  some values from: E30 Right
subclass of: Restriction
  on property: P105 right held by
  some values from: E39 Actor
notation: E72

P12 occurred in the presence of
type: ObjectProperty
type: NamedIndividual
comment: Quantification: many to many, necessary (1,n:0,n) Scope note: This property describes the active or passive presence of an E77 Persistent Item in an instance of E5 Event without implying any specific role. It documents known events in which an instance of E77 Persistent Item was present during the course of its life or history. For example, an object may be the desk, now in a museum, on which a treaty was signed. The instance of E53 Place and the instance of E52 Time-Span where and when these events happened provide constraints about the presence of the related instance E77 Persistent Item in the past. Instances of E90 Symbolic Object, in particular information objects, are physically present in events via at least one of the instances of E18 Physical Thing carrying them. Note, that the human mind can be such a carrier. A precondition for a transfer of information to a person or another new physical carrier is the presence of the respective information object and this person or physical thing in one event. Examples: - Deckchair 42 (E19) was present at the sinking of the Titanic (E5). (Aldridge, 2008) In First Order Logic: - P12(x,y) ⇒ E5(x) - P12(x,y) ⇒ E77(y)
domain: E5 Event
label: P12 a eu lieu en présence de @fr
label: P12 fand statt im Beisein von @de
label: P12 ocorreu na presença de @pt
label: P12 συνέβη παρουσία του/της @el
label: P12 появился в присутствии @ru
label: P12 已出现 @zh
range: E77 Persistent Item
inverse of: P12 was present at
notation: P12

P3 has note
type: DatatypeProperty
type: NamedIndividual
comment: Quantification: one to many (0,n:0,1) Scope note: This property is a container for all informal descriptions about an object that have not been expressed in terms of CIDOC CRM constructs. In particular, it captures the characterisation of the item itself, its internal structures, appearance, etc. Like property P2 has type (is type of), this property is a consequence of the restricted focus of the CIDOC CRM. The aim is not to capture, in a structured form, everything that can be said about an item; indeed, the CIDOC CRM formalism is not regarded as sufficient to express everything that can be said. Good practice requires use of distinct note fields for different aspects of a characterisation. The P3.1 has type property of P3 has note allows differentiation of specific notes, e.g. “construction”, “decoration”, etc. An item may have many notes, but a note is attached to a specific item. Examples: - Coffee mug – OXCMS:1983.1.1 (E19) has note “chipped at edge of handle” (E62) has type Condition (E55). (fictitious) Properties: - P3.1 has type: E55 Type In First Order Logic: - P3(x,y) ⇒ E1(x) - P3(x,y) ⇒ E62(y) - P3(x,y,z) ⇒ [P3(x,y) ∧ E55(z)]
domain: E1 CRM Entity
label: P3 a pour note @fr
label: P3 hat Anmerkung @de
label: P3 tem nota @pt
label: P3 έχει επεξήγηση @el
label: P3 имеет примечание @ru
label: P3 有注释 @zh
notation: P3

P14 performed
type: ObjectProperty
type: NamedIndividual
comment: Quantification of the inverse property: many to many, necessary (1,n:0,n) Scope note of the inverse property: This property describes the active participation of an instance of E39 Actor in an instance of E7 Activity. It implies causal or legal responsibility. The P14.1 in the role of property of the property specifies the nature of an Actor’s participation. Examples of the inverse property: - The painting of the Sistine Chapel (E7) carried out by Michelangelo Buonaroti (E21) in the role of master craftsman (E55). (Goldscheider, 1953) In First Order Logic of the inverse property: - P14(x,y) ⇒ E7(x) - P14(x,y)⇒ E39(y) - P14(x,y) ⇒ P11(x,y) - P14(x,y,z) ⇒ [P14(x,y) ∧ E55(z)]
domain: E39 Actor
label: P14 a effectué @fr
label: P14 executou @pt
label: P14 führte aus @de
label: P14 πραγματοποίησε @el
label: P14 выполнял @ru
label: P14 执行 @zh
range: E7 Activity
sub property of: P11 participated in
notation: P14i

P105 has right on
type: ObjectProperty
type: NamedIndividual
comment: Quantification of the inverse property: many to many (0,n:0,n) Scope note of the inverse property: This property identifies the instance of E39 Actor who holds the instances of E30 Right to an instance of E72 Legal Object. It is a superproperty of P52 has current owner (is current owner of) because ownership is a right that is held on the owned object. This property is a shortcut of the fully developed path from E72 Legal Object, P104 is subject to, E30 Right, P75i is possessed by to E39 Actor. Examples of the inverse property: - The Beatles back catalogue (E73) right held by Michael Jackson (E21). (Raga, 2016) In First Order Logic of the inverse property: - P105(x,y) ⇒ E72(x) - P105(x,y) ⇒ E39(y) - P105(x,y) ⇐ (∃z) [E30(z) ˄ P104(x,z) ˄ P75i(z,y)]
domain: E39 Actor
label: P105 détient le droit sur @fr
label: P105 hat Rechte an @de
label: P105 possui direitos sobre @pt
label: P105 έχει δικαίωμα σε @el
label: P105 владеет правом на @ru
label: P105 有权利 @zh
range: E72 Legal Object
notation: P105i

P55 has current location
type: ObjectProperty
type: NamedIndividual
comment: Quantification: many to many (0,n:0,n) Scope note: This property records the location of an instance of E19 Physical Object at the time of validity of the record or database containing the statement that uses this property. This property is a specialisation of P53 has former or current location (is former or current location of). It indicates that the instance of E53 Place associated with the instance of E19 Physical Object is the current location of the object. The property does not allow any indication of how long the object has been at the current location. This property is a shortcut. A more detailed representation can make use of the fully developed (i.e., indirect) path from E19 Physical Object, through, P25i moved by, E9 Move, P26 moved to to E53 Place if and only if this Move is the most recent. Examples: - Silver cup 232 (E22) has current location Display Cabinet 23, Room 4, British Museum (E53). (fictitious) In First Order Logic: - P55(x,y) ⇒ E19(x) - P55(x,y) ⇒ E53(y) - P55(x,y) ⇒ P53(x,y) - P55(x,y) ⇐ (∃z) [ [E9(z) ˄ P25i(x,z) ˄ P26(z,y)] - ˄ ¬​ (∃w) [E9(w) ˄ P25i(x,w) ˄ P27(w,y)˄ P182(z,w)]]​
domain: E19 Physical Object
label: P55 a actuellement pour localisation @fr
label: P55 hat derzeitigen Standort @de
label: P55 é localizado em @pt
label: P55 βρίσκεται σε @el
label: P55 в данный момент находится в @ru
label: P55 有当前位置 @zh
range: E53 Place
sub property of: P53 has former or current location
inverse of: P55 currently holds
notation: P55

P164 temporally specifies
type: ObjectProperty
type: NamedIndividual
comment: Quantification of the inverse property: many to one, necessary(1,1:0,n) Scope note of the inverse property: This property relates an instance of E93 Presence with the instance of E52 Time-Span that defines the time-slice of the spacetime volume that this instance of E93 Presence is related to via the property P166 was a presence of (had presence). There are two typical cases for the determination of the related instance of E52 Time-Span. In the first, it is the temporal extent of an instance of E2 Temporal Entity (documented with P4 has time-span (is time-span of)): this then documents the simultaneity of the instance of E93 Presence and the instance of E2 Temporal Entity, even if the absolute time-span is not known, and can be regarded as a phenomenal time-span. In the second, the instance of E52 Time-Span is a date range declared in or derived from historical sources or provided by dating methods: this is a declarative time-span. Examples of the inverse property: - 2016-02-09 (E52) temporally specifies the last day of the 2016 Carnival in Cologne (E93). - Johann Joachim Winckelmann’s whereabouts in December 1755 (E93) is temporally specified by December 1755 (E52.) (Leppmann, 1970) - Johann Joachim Winckelmann’s whereabouts from 19(th) November 1755 until 9(th) April 1768 (E93) is temporally specified by 19(th) November 1755 until 9(th) April 1768 (E52). (Leppmann, 1970) In First Order Logic of the inverse property: - P164(x,y) ⇒ E93(x) - P164(x,y) ⇒ E52(y) - P164(x,y) ⇒ P160(x,y)
domain: E52 Time-Span
label: P164 spécifie temporellement @fr
range: E93 Presence
sub property of: P160 is temporal projection of
notation: P164i

P187 is production plan for
type: ObjectProperty
type: NamedIndividual
comment: Quantification of the inverse property: one to many, necessary (1,n:0,1) Scope note of the inverse property: This property associates an instance of E99 Product Type with an instance of E29 Design or Procedure that completely determines the production of instances of E18 Physical Thing. The resulting instances of E18 Physical Thing are considered exemplars of this instance of E99 Product Type when the process specified is correctly executed. Note that the respective instance of E29 Design or Procedure may not necessarily be fixed in a written/graphical form, and may require the use of tools or models unique to the product type. The same instance of E99 Product Type may be associated with several variant plans. Examples of the inverse property: - Volkswagen Type 11 (Beetle) (E99) has production plan the production plans for Volkswagen Type 11 (Beetle) (E29). (Rieger, 2013) In First Order Logic of the inverse property: - P187(x,y) ⇒ E99(x) - P187(x,y) ⇒ E29(y)
domain: E29 Design or Procedure
label: P187 est le plan de production de @fr
range: E99 Product Type
notation: P187i

P9 forms part of
type: ObjectProperty
type: TransitiveProperty
type: NamedIndividual
comment: Quantification of the inverse property: many to many (0,n:0,n) Scope note of the inverse property: This property associates an instance of E4 Period with another instance of E4 Period that is defined by a subset of the phenomena that define the former. Therefore, the spacetime volume of the latter must fall within the spacetime volume of the former. This property is transitive and asymmetric. Examples of the inverse property: - Cretan Bronze Age (E4) consists of Middle Minoan (E4). (Hood, 1971) In First Order Logic of the inverse property: - P9(x,y) ⇒ E4(x) - P9(x,y) ⇒ E4(y) - P9(x,y) ⇒ P10(y,x) - [P9(x,y) ∧ P9(y,z)] ⇒ P9(x,z) - P9(x,y) ⇒ ¬P9(y,x)
domain: E4 Period
label: P9 bildet Teil von @de
label: P9 fait partie de @fr
label: P9 faz parte de @pt
label: P9 αποτελεί μέρος του/της @el
label: P9 формирует часть @ru
label: P9 组成部分 @zh
range: E4 Period
sub property of: P10 falls within
notation: P9i

P148 is component of
type: ObjectProperty
type: TransitiveProperty
type: NamedIndividual
comment: Quantification of the inverse property: many to many (0,n:0,n) Scope note of the inverse property: This property associates an instance of E89 Propositional Object with a structural part of it that is by itself an instance of E89 Propositional Object. This property is transitive. This property is asymmetric. Examples of the inverse property: - Dante’s “Divine Comedy” (E89) has component Dante’s “Hell” (E89). (Alighieri, 1956) In First Order Logic of the inverse property: - P148(x,y) ⇒ E89(x) - P148(x,y) ⇒ E89(y) - [P148(x,y) ∧ P148(y,z)] ⇒ P148(x,z) - P148(x,y) ⇒ ¬P148(y,x)
domain: E89 Propositional Object
label: P148 est le composant de @fr
label: P148 ist Bestandteil von @de
label: P148 是组件 @zh
range: E89 Propositional Object
notation: P148i

P91 is unit of
type: ObjectProperty
type: NamedIndividual
comment: Quantification of the inverse property: many to one, necessary (1,1:0,n) Scope note of the inverse property: This property shows the type of unit an instance of E54 Dimension was expressed in. Examples of the inverse property: - The height of silver cup 232 (E54) has unit mm (E58). (fictitious) In First Order Logic of the inverse property: - P91(x,y) ⇒ E54(x) - P91(x,y) ⇒ E58(y)
domain: E58 Measurement Unit
label: P91 est l’unité de mesure de @fr
label: P91 ist Einheit von @de
label: P91 é unidade de @pt
label: P91 αποτελεί μονάδα μέτρησης του/της @el
label: P91 является единицей для @ru
label: P91 所属单位 @zh
range: E54 Dimension
notation: P91i

E9 Move
type: Class
type: NamedIndividual
comment: Scope note: This class comprises changes of the physical location of the instances of E19 Physical Object. Note, that the class E9 Move inherits the property P7 took place at (witnessed): E53 Place. This property should be used to describe the trajectory or a larger area within which a move takes place, whereas the properties P26 moved to (was destination of), P27 moved from (was origin of) describe the start and end points only. Moves may also be documented to consist of other moves (via P9 consists of (forms part of)), in order to describe intermediate stages on a trajectory. In that case, start and end points of the partial moves should match appropriately between each other and with the overall event. Examples: - the relocation of London Bridge from the UK to the USA (Wildfang, 2005) - the movement of the exhibition “Tutankhamun: Treasures of the Golden Pharaoh” between 15(th) September and 2(nd) November 2019 In First Order Logic: - E9(x) ⇒ E7(x)
label: E9 Déplacement @fr
label: E9 Locomoção @pt
label: E9 Objektbewegung @de
label: E9 Μετακίνηση @el
label: E9 Перемещение @ru
label: E9 移动 @zh
subclass of: E7 Activity
subclass of: Restriction
  on property: P25 moved
  some values from: E19 Physical Object
subclass of: Restriction
  on property: P26 moved to
  some values from: E53 Place
subclass of: Restriction
  on property: P27 moved from
  some values from: E53 Place
notation: E9

P127 has narrower term
type: ObjectProperty
type: TransitiveProperty
type: NamedIndividual
comment: Quantification of the inverse property: many to many (0,n:0,n) Scope note of the inverse property: This property associates an instance of E55 Type with another instance of E55 Type that has a broader meaning. It allows instances of E55 Types to be organised into hierarchies. This is the sense of “broader term generic (BTG)” as defined in ISO 25964-2:2013 (International Organization for Standardization 2013). This property is transitive. This property is asymmetric. Examples of the inverse property: - dime (E55) has broader term coin (E55). (Yerkes, 1989) In First Order Logic of the inverse property: - P127(x,y) ⇒ E55(x) - P127(x,y) ⇒ E55(y) - [P127(x,y) ∧ P127(y,z)] ⇒ P127(x,z) - P127(x,y) ⇒ ¬P127(y,x)
domain: E55 Type
label: P127 a pour terme spécifique @fr
label: P127 hat den Unterbegriff @de
label: P127 tem termo específico @pt
label: P127 έχει στενότερο όρο @el
label: P127 имеет нижестоящий термин @ru
label: P127 下位词 @zh
range: E55 Type
notation: P127i

P102 has title
type: ObjectProperty
type: NamedIndividual
comment: Quantification: many to many (0,n:0,n) Scope note: This property associates an instance of E35 Title that has been applied to an instance of E71 Human-Made Thing. The P102.1 has type property of the P102 has title (is title of) property enables the relationship between the title and the thing to be further clarified, for example, if the title was a given title, a supplied title etc. It allows any human-made material or immaterial thing to be given a title. It is possible to imagine a title being created without a specific object in mind. Examples: - The first book of the Old Testament (E33) has title “Genesis” (E35) has type translated title (E55) (E55). (Brueggemann, 1982) - Monet’s painting from 1868-1869 held by Musée d’Orsay, Paris, under inventory number RF 1984 164 (E22) has title “La Pie” (E35) has type creator’s title (E55). (Musée d’Orsay, 2020) - Monet’s painting from 1868-1869 held by Musée d'Orsay, Paris, under inventory number RF 1984 164 (E22) has title “The Magpie” (E35) has type translated title (E55). (Musée d'Orsay, 2020) Properties: - P102.1 has type: E55 Type In First Order Logic: - P102(x,y) ⇒ E71(x) - P102(x,y) ⇒ E35(y) - P102(x,y,z) ⇒ [P102(x,y) ∧ E55(z)] - P102(x,y) ⇒ P1(x,y)
domain: E71 Human-Made Thing
label: P102 a pour titre @fr
label: P102 tem título @pt
label: P102 trägt den Titel @de
label: P102 έχει τίτλο @el
label: P102 имеет заголовок @ru
label: P102 有题名 @zh
range: E35 Title
sub property of: P1 is identified by
inverse of: P102 is title of
notation: P102

P50 has current keeper
type: ObjectProperty
type: NamedIndividual
comment: Quantification: many to many (0,n:0,n) Scope note: This property identifies the instance of E39 Actor that had custody of an instance of E18 Physical Thing at the time of validity of the record or database containing the statement that uses this property. This property is a shortcut for the more detailed path from E18 Physical Thing through, P30i custody transferred through, E10 Transfer of Custody, P29 custody received by to E39 Actor, if and only if the custody has not been surrendered by the receiving actor at any later time Examples: - The paintings from The Iveagh Bequest (E78) has current keeper The National Gallery (E74) (Iveagh Bequest, 1975) In First Order Logic: - P50(x,y) ⇒ E18(x) - P50(x,y) ⇒ E39(y) - P50(x,y) ⇒ P49(x,y) - P50(x,y) ⇐ (∃z) [[E10(z) ˄ P30i(x,z) ˄ P29(z,y) ] - ˄ ¬ (∃w) [E10(w) ˄ P30i(x,w) ˄ P28(w,y)˄ P182(z,w)]]
domain: E18 Physical Thing
label: P50 a pour actant détenteur actuel @fr
label: P50 hat derzeitigen Betreuer @de
label: P50 é guardada por @pt
label: P50 είναι στην κατοχή του @el
label: P50 имеет текущего смотрителя @ru
label: P50 有当前保管者 @zh
range: E39 Actor
sub property of: P49 has former or current keeper
inverse of: P50 is current keeper of
notation: P50

P56 bears feature
type: ObjectProperty
type: NamedIndividual
comment: Quantification: one to many, dependent (0,n:1,1) Scope note: This property links an instance of E19 Physical Object to an instance of E26 Physical Feature that it bears. An instance of E26 Physical Feature can only exist on one object. One object may bear more than one E26 Physical Feature. An instance of E27 Site should be considered as an instance of E26 Physical Feature on the surface of the Earth. An instance B of E26 Physical Feature being a detail of the structure of another instance A of E26 Physical Feature can be linked to B by use of the property P46 is composed of (forms part of). This implies that the subfeature B is P56i is found on the same E19 Physical Object as A. This property is a shortcut. A more detailed representation can make use of the fully developed (i.e. indirect) path E19 Physical Object, through, P59 has section, E53 Place, P53i is former or current location of to E26 Physical Feature. Examples: - Silver cup 232 (E22) bears feature 32 mm scratch on silver cup 232 (E26). (fictitious) In First Order Logic: - P56(x,y) ⇒E19(x) - P56(x,y) ⇒ E26(y) - P56(x,y) ⇒ P46(x,y) - P56(x,y) ⇐ (∃z) [E53(z) ˄ P59(x,z) ˄ P53i(z,y)]
domain: E19 Physical Object
label: P56 a pour caractéristique @fr
label: P56 possui característica @pt
label: P56 trägt Merkmal @de
label: P56 φέρει μόρφωμα @el
label: P56 несет признак @ru
label: P56 有特征 @zh
range: E26 Physical Feature
sub property of: P46 is composed of
inverse of: P56 is found on
notation: P56

E90 Symbolic Object
type: Class
type: NamedIndividual
comment: Scope note: This class comprises identifiable symbols and any aggregation of symbols, such as characters, identifiers, traffic signs, emblems, texts, data sets, images, musical scores, multimedia objects, computer program code, or mathematical formulae that have an objectively recognizable structure and that are documented as single units. It includes sets of signs of any nature, which may serve to designate something, or to communicate some propositional content. An instance of E90 Symbolic Object may or may not have a specific meaning, for example an arbitrary character string. In some cases, the content of an instance of E90 Symbolic Object may completely be represented by a serialized digital content model, such as a sequence of ASCII-encoded characters, an XML or HTML document, or a TIFF image. The property P3 has note and its subproperty P190 has symbolic content allow for the description of this content model. In order to disambiguate which symbolic level is the carrier of the meaning, the property P3.1 has type can be used to specify the encoding (e.g. “bit”, “Latin character”, RGB pixel). Examples: - ‘ecognizabl’ - the “no-smoking” sign (E36) - “BM000038850.JPG” (E41) [identifies a digital image] (Natural History Museum, 2021) - image BM000038850.JPG from the Clayton Herbarium in London (E36) [depicts specimen of Verbesina virginica] (Natural History Museum, 2021) - the distribution of form, tone and colour found on Leonardo da Vinci’s painting named “Mona Lisa” in daylight (E36) - the Italian text of Dante’s “Divina Commedia” as found in the authoritative critical edition “La Commedia secondo l’antica vulgata a cura di Giorgio Petrocchi” (E33) (Petrocchi, 1967) In First Order Logic: - E90(x) ⇒ E28(x) - E90(x) ⇒ E72(x)
label: E90 Objet symbolique @fr
label: E90 Symbolisches Objekt @de
label: E90 符号对象 @zh
subclass of: E28 Conceptual Object
subclass of: E72 Legal Object
subclass of: Restriction
  on property: P106 is composed of
  some values from: E90 Symbolic Object
notation: E90

P101 had as general use
type: ObjectProperty
type: NamedIndividual
comment: Quantification: many to many (0,n:0,n) Scope note: This property associates an instance of E70 Thing with an instance of E55 Type that describes the type of use that it was actually employed for. It allows the relationship between particular things, both physical and immaterial, and the general methods and techniques of real use to be documented. This may well be different from the intended functional purpose of the instance of E70 Thing (which can be documented with P103 was intended for (was intention of)). For example, it could be recorded that a particular wooden crate had a general use as a shelf support on a market stall even though it had been originally intended for carrying vegetables. The use of this property is intended to allow the documentation of usage patterns attested in historical records or through scientific investigation (for instance ceramic residue analysis). It should not be used to document the intended, and thus assumed, use of an object. Examples: - Tony Gill’s Ford Mustang (E22) had as general use transportation (E55). - The Egyptian unglazed vessel used in the 2003 study reported by Barnard et al. (E22) had as general use camel milk preparation (E55). (Barnard et al., 2007) In First Order Logic: - P101(x,y) ⇒ E70(x) - P101(x,y) ⇒ E55(y) - P101(x,y) ⇒ (∃z)[E7(z) ∧ P16i(,x,z) ∧ P2(z,y)]
domain: E70 Thing
label: P101 a eu pour usage général @fr
label: P101 hatte die allgemeine Verwendung @de
label: P101 tem como uso geral @pt
label: P101 είχε ως γενική χρήση @el
label: P101 имел основное применение @ru
label: P101 有一般用途 @zh
range: E55 Type
inverse of: P101 was use of
notation: P101

P12 was present at
type: ObjectProperty
type: NamedIndividual
comment: Quantification of the inverse property: many to many, necessary (1,n:0,n) Scope note of the inverse property: This property describes the active or passive presence of an E77 Persistent Item in an instance of E5 Event without implying any specific role. It documents known events in which an instance of E77 Persistent Item was present during the course of its life or history. For example, an object may be the desk, now in a museum, on which a treaty was signed. The instance of E53 Place and the instance of E52 Time-Span where and when these events happened provide constraints about the presence of the related instance E77 Persistent Item in the past. Instances of E90 Symbolic Object, in particular information objects, are physically present in events via at least one of the instances of E18 Physical Thing carrying them. Note, that the human mind can be such a carrier. A precondition for a transfer of information to a person or another new physical carrier is the presence of the respective information object and this person or physical thing in one event. Examples of the inverse property: - Deckchair 42 (E19) was present at the sinking of the Titanic (E5). (Aldridge, 2008) In First Order Logic of the inverse property: - P12(x,y) ⇒ E5(x) - P12(x,y) ⇒ E77(y)
domain: E77 Persistent Item
label: P12 a été présent à @fr
label: P12 estava presente no @pt
label: P12 war anwesend bei @de
label: P12 ήταν παρών/παρούσα/παρόν σε @el
label: P12 присутствовал при @ru
label: P12 出现在 @zh
range: E5 Event
notation: P12i

P142 used constituent
type: ObjectProperty
type: NamedIndividual
comment: Quantification: many to many (0,n:0,n) Scope note: This property associates an instance of E15 Identifier Assignment with the instance of E90 Symbolic Object used as constituent of an instance of E42 Identifier in this act of assignment. Examples: - Assigning the personal name identifier “Guillaume, de Machaut, ca. 1300-1377” on 1(st) June 2001 (E15) used constituent “ca. 1300-1377” (E41). (Kelly, 2014) - Assigning a uniform title to the anonymous textual work known as ‘The Adoration of the Shepherds’(E15) used constituent “Coventry” (E41). (Encyclopedia Britannica, 1998) - Assigning a uniform title to Pina Bausch’s choreographic work entitled ‘Rite of spring’ (E15) used constituent “(Choreographic Work: Bausch)” (E90). (Brandstetter and Klein, 2015) - Assigning a uniform title to the motion picture directed in 1933 by Merian C. Cooper and Ernest B. Schoedsack and entitled ‘King Kong’ (E15) used constituent “1933” (E61). (Goldner and Turner, 1976) - Assigning the corporate name identifier ‘Univerza v Ljubljani. Oddelek za bibliotekarstvo’ to The Department for library science of the University of Ljubljana in 2018 (E15) used constituent “Univerza v Ljubljani” (E42). [Done by the Department of Library and Information Science and Book Studies Library, University of Ljubljana in 2018] In First Order Logic: - P142(x,y) ⇒ E15(x) - P142(x,y) ⇒ E90(y) - P142(x,y) ⇒ P16(x,y)
domain: E15 Identifier Assignment
label: P142 a mobilisé comme élément @fr
label: P142 benutzte Bestandteil @de
label: P142 使用构成成分 @zh
range: E90 Symbolic Object
sub property of: P16 used specific object
inverse of: P142 was used in
notation: P142

P26 moved to
type: ObjectProperty
type: NamedIndividual
comment: Quantification: many to many, necessary (1,n:0,n) Scope note: This property identifies a destination, an instance of E53 Place, of an instance of E9 Move. A move will be linked to a destination, such as the move of an artifact from storage to display. A move may be linked to many terminal instances of E53 Place by multiple instances of this property. In this case the move describes a distribution of a set of objects. The area of the move includes the origin(s), route and destination(s). Therefore, the described destination is an instance of E53 Place which P89 falls within (contains) the instance of E53 Place the move P7 took place at. Examples: - The movement of the exhibition “Tutankhamun: Treasures of the Golden Pharaoh” between 15(th) September and 2(nd) November 2019 (E9) moved to the Saatchi Gallery London (E53). In First Order Logic: - P26(x,y) ⇒ E9(x) - P26(x,y) ⇒ E53(y) - P26(x,y) ⇒ (∃z) [E53(z) ∧ P7(x,z) ∧ P89(y,z)]
domain: E9 Move
label: P26 a déplacé vers @fr
label: P26 bewegte bis zu @de
label: P26 locomoveu para @pt
label: P26 μετακινήθηκε προς @el
label: P26 перемещен в @ru
label: P26 移至 @zh
range: E53 Place
inverse of: P26 was destination of
notation: P26

P35 was identified by
type: ObjectProperty
type: NamedIndividual
comment: Quantification of the inverse property: many to many, necessary (1,n:0,n) Scope note of the inverse property: This property identifies the instance of E3 Condition State that was observed in an instance of E14 Condition Assessment activity. Examples of the inverse property: - The condition assessment of silver cup 232 in 1997 (E14) has identified oxidation traces were present in 1997 (E3). [which has type (P2) with oxidation traces (E55)] (fictitious) - The condition assessment of the cover of MS Sinai Greek 418 (E13) has identified the condition state in November 2003 (E3). [which has type fine (E55)] (Honey and Pickwoad, 2010) - The condition assessment of the endband cores of MS Sinai Greek 418 (E14) has identified the condition state in November 2003 (E3). [which has type broken (E55)] (Honey and Pickwoad, 2010) In First Order Logic of the inverse property: - P35(x,y) ⇒E14(x) - P35(x,y) ⇒ E3(y) - P35(x,y) ⇒ P141(x,y)
domain: E3 Condition State
label: P35 a été identifié par @fr
label: P35 foi identificado por @pt
label: P35 wurde identifiziert durch @de
label: P35 έχει διαπιστωθεί από @el
label: P35 идентифицирован посредством @ru
label: P35 被标识 @zh
range: E14 Condition Assessment
sub property of: P141 was assigned by
notation: P35i

P173 starts before or with the end of
type: ObjectProperty
type: NamedIndividual
comment: Quantification: many to many (0,n:0,n) Scope note: This property specifies that the temporal extent of the domain instance A of E2 Temporal Entity starts before or simultaneously with the end of the temporal extent of the range instance B of E2 Temporal Entity. In other words, if A = [A(start), A(end)] and B = [B(start), B(end)], it means A(start) ≤ B(end) is true. This property is part of the set of temporal primitives P173 – P176, P182 – P185. This property corresponds to the disjunction (logical OR) of the following Allen temporal relations (Allen, 1983): {before, meets, met-by, overlaps, starts, started-by, contains, finishes, finished-by, equals, during, overlapped by}. This property is not transitive. https://cidoc-crm.org/html/version_images/images_7.1.3/image_01.png Figure 8: Temporal entity A starts before or with the end of temporal entity B. Here A is longer than B https://cidoc-crm.org/html/version_images/images_7.1.3/image_02.png Figure 9: Temporal entity A starts before or with the end of temporal entity B. Here A is shorter than B Examples: - The legendary run from Marathon to Athens 490BC (E7) starts before or with the end of The Battle of Marathon 490BC (E7). - LMIIB (E4) ends after or with the start of the Tutankhamun period (1332-1323 B.C.E.) (E4). [Evidence for this is provided by the scarab seal found at Poros in a context of LMIIB. The scarab belongs to the type “nh.s n Jmn”. During the Akhenaten period he production of these scarab seals stopped (the name of Amun is not referred to during his reign). So the scarab could not have been produced before the Tutankhamun period and is probably a later production.] (Karetsou, 2000) In First Order Logic: - P173(x,y) ⇒ E2(x) - P173(x,y) ⇒ E2(y)
domain: E2 Temporal Entity
label: P173 commence avant ou au moment de la fin de @fr
range: E2 Temporal Entity
inverse of: P173 ends after or with the start of
notation: P173

P16 was used for
type: ObjectProperty
type: NamedIndividual
comment: Quantification of the inverse property: many to many (0,n:0,n) Scope note of the inverse property: This property describes the use of material or immaterial things in a way essential to the performance or the outcome of an instance of E7 Activity. This property typically applies to tools, instruments, moulds, raw materials and items embedded in a product. It implies that the presence of the object in question was a necessary condition for the action. For example, the activity of writing this text required the use of a computer. An immaterial thing can be used if at least one of its carriers is present. For example, the software tools on a computer. Another example is the use of a particular name by a particular group of people over some span to identify a thing, such as a settlement. In this case, the physical carriers of this name are at least the people understanding its use. Examples of the inverse property: - The writing of the scope note of the CIDOC CRM property “P16 used specific object” contained in the CIDOC CRM version 4.1 (E7) used specific object Nicholas Crofts’ computer (E22) mode of use Typing Tool; Storage Medium (E55). [the original scope note was later extended in the CIDOC CRM version 4.3] - The people of Iraq calling the place identified by TGN ‘7017998’ (E7) used specific object “Quyunjig” (E41) mode of use current; vernacular (E55). In First Order Logic of the inverse property: - P16(x,y) ⇒ E7(x) - P16(x,y) ⇒ E70(y) - P16(x,y) ⇒ P12(x,y) - P16(x,y) ⇒ P15(x,y) - P16(x,y,z) ⇒ [P16(x,y) ∧ E55(z)]
domain: E70 Thing
label: P16 a été mobilisé pour @fr
label: P16 foi usado por @pt
label: P16 wurde benutzt für @de
label: P16 χρησιμοποιήθηκε για @el
label: P16 был использован для @ru
label: P16 用于 @zh
range: E7 Activity
sub property of: P12 was present at
sub property of: P15 influenced
notation: P16i

P180 was currency of
type: ObjectProperty
type: NamedIndividual
comment: Quantification of the inverse property: many to one, necessary (1,1:0,n) Scope note of the inverse property: This property establishes the relationship between an instance of E97 Monetary Amount and the instance of E98 Currency that it is measured in. Examples of the inverse property: - Christie’s hammer price for Vincent van Gogh’s “Still Life: Vase with Fifteen Sunflowers” in London on 30(th) March 1987 (E97) has currency British Pounds (E98). In First Order Logic of the inverse property: - P180(x,y) ⇒ E97(x) - P180(x,y) ⇒ E98(y) - P180(x,y) ⇒ P91(x,y)
domain: E98 Currency
label: P180 était l’unité monétaire de @fr
range: E97 Monetary Amount
sub property of: P91 is unit of
notation: P180i

P157 is at rest relative to
type: ObjectProperty
type: NamedIndividual
comment: Quantification: many to many, necessary(1,n:0,n) Scope note: This property associates an instance of E53 Place with the instance of E18 Physical Thing that determines a reference space for this instance of E53 Place by being at rest with respect to this reference space. The relative stability of form of an instance of E18 Physical Thing defines its default reference space. The reference space is not spatially limited to the referred thing. For example, a ship determines a reference space in terms of which other ships in its neighbourhood may be described. Larger constellations of matter, such as continental plates, may comprise many physical features that are at rest with them and define the same reference space. Examples: - The spatial extent of the municipality of Athens in 2014 (E53) is at rest relative to The Royal Observatory in Greenwich (E25). (Maunder, 1900) - The place where Lord Nelson died on H.M.S. Victory (E53) is at rest relative to H.M.S. Victory (E22). (Adkin, 2005) In First Order Logic: - P157(x,y) ⇒ E53(x) - P157(x,y) ⇒ E18(y)
domain: E53 Place
label: P157 est à l’arrêt par rapport à @fr
range: E18 Physical Thing
inverse of: P157 provides reference space for
notation: P157

P124 transformed
type: ObjectProperty
type: NamedIndividual
comment: Quantification: one to many, necessary (1,n:0,1) Scope note: This property identifies the instance or instances E18 Physical Thing that have ceased to exist due to an instance of E81 Transformation. The item that has ceased to exist and was replaced by the result of the Transformation. The continuity between both items, the new and the old, is expressed by the links to the common instance of E81 Transformation. Examples: - The transformation of the Venetian Loggia in Heraklion into a city hall (E81, E12) transformed the Venetian Loggia in Heraklion (E24). (Municipality of Heraklion, 2021) - The mummification of Tut-Ankh-Amun (E81, E12) transformed the deceased Pharaoh Tut-Ankh-Amun (E21). (Carter & Mace, 1977) - The death, carbonization and petrification of some people of Pompeii in 79AD by the intense heat of a pyroclastic cloud and ashes from the eruption of Mount Vesuvius (E69, E81) transformed some people of Pompeii (E21). [AND: was death of (P100) some people of Pompeii (E21).] In First Order Logic: - P124(x,y) ⇒ E81(x) - P124(x,y) ⇒ E18(y) - P124(x,y) ⇒ P93(x,y)
domain: E81 Transformation
label: P124 a transformé @fr
label: P124 transformou @pt
label: P124 wandelte um @de
label: P124 μετέτρεψε @el
label: P124 трансформировал @ru
label: P124 转变了 @zh
range: E18 Physical Thing
sub property of: P93 took out of existence
inverse of: P124 was transformed by
notation: P124

P11 had participant
type: ObjectProperty
type: NamedIndividual
comment: Quantification: many to many (0,n:0,n) Scope note: This property describes the active or passive participation of instances of E39 Actors in an instance of E5 Event. It documents known events in which an instance of E39 Actor has participated during the course of that actor’s life or history. The instances of E53 Place and E52 Time-Span where and when these events happened provide constraints about the presence of the related instances of E39 Actor in the past. Collective actors, i.e. instances of E74 Group, may physically participate in events via their representing instances of E21 Persons only. The participation of multiple actors in an event is most likely an indication of their acquaintance and interaction. The property implies that the actor was involved in the event but does not imply any causal relationship. For instance, someone having been portrayed can be said to have participated in the creation of the portrait. Examples: - Napoleon (E21) participated in The Battle of Waterloo (E7). (Dawson, 2018) - Maria (E21) participated in Photographing of Maria (E7). (fictitious) In First Order Logic: - P11(x,y) ⇒ E5(x) - P11(x,y) ⇒ E39(y) - P11(x,y) ⇒ P12(x,y)
domain: E5 Event
label: P11 a eu pour actant participant @fr
label: P11 hatte Teilnehmer @de
label: P11 tem participante @pt
label: P11 είχε συμμέτοχο @el
label: P11 имел участника @ru
label: P11 有参与者 @zh
range: E39 Actor
sub property of: P12 occurred in the presence of
inverse of: P11 participated in
notation: P11

P143 was joined by
type: ObjectProperty
type: NamedIndividual
comment: Quantification of the inverse property: many to many, necessary (1,n:0,n) Scope note of the inverse property: This property identifies the instance of E39 Actor that becomes member of an instance of E74 Group in an instance of E85 Joining. Joining events allow for describing actors becoming members of a group with the more detailed path E74 Group, P144i gained member by, E85 Joining, P143 joined, E39 Actor, compared to the shortcut offered by P107 has current or former member (is current or former member of). Examples of the inverse property: - The election of Sir Isaac Newton as Member of Parliament to the Convention Parliament of 1689 (E85) joined Sir Isaac Newton (E21). (Iliffe, 2013) - The inauguration of Mikhail Sergeyevich Gorbachev as leader of the Union of Soviet Socialist Republics (USSR) in 1985 (E85) joined Mikhail Sergeyevich Gorbachev (E21). (Galeotti, 1997) - The implementation of the membership treaty 1(st) January 1973 between EU and Denmark (E85) joined Denmark (E74). In First Order Logic of the inverse property: - P143(x,y) ⇒ E85(x) - P143(x,y) ⇒ E39(y) - P143(x,y) ⇒ P11(x,y)
domain: E39 Actor
label: P143 a adhéré par @fr
label: P143 wurde verbunden durch @de
label: P143 被加入 @zh
range: E85 Joining
sub property of: P11 participated in
notation: P143i

E74 Group
type: Class
type: NamedIndividual
comment: Scope note: This class comprises any gatherings or organizations of human individuals or groups that act collectively or in a similar way due to any form of unifying relationship. In the wider sense this class also comprises official positions which used to be regarded in certain contexts as one actor, independent of the current holder of the office, such as the president of a country. In such cases, it may happen that the group never had more than one member. A joint pseudonym (i.e. a name that seems indicative of an individual but that is actually used as a persona by two or more people) is a particular case of E74 Group. A gathering of people becomes an instance of E74 Group when it exhibits organizational characteristics usually typified by a set of ideas or beliefs held in common, or actions performed together. These might be communication, creating some common artifact, a common purpose such as study, worship, business, sports, etc. Nationality can be modelled as membership in an instance of E74 Group. Married couples and other concepts of family are regarded as particular examples of E74 Group. Examples: - the Impressionists (Wilson, 1994) - the Navajo (Correll, 1972) - the Greeks (Williams, 1993) - the peace protestors in New York City on 15(th) February 2003 - Exxon-Mobil (Raymond, 2006) - King Solomon and his wives (Thieberger, 1947) - the President of the Swiss Confederation - Nicolas Bourbaki [the collective pseudonym of a group of mathematicians, predominantly French alumni of the École normale supérieure] (Aczel, 2007) - Betty Crocker (Crocker, 2012) - Ellery Queen [Ellery Queen is a pseudonym created in 1929 by American crime fiction writers Frederic Dannay and Manfred Bennington Lee.] (Wheat, 2005) - Greenpeace - Paveprime Ltd - the National Museum of Denmark In First Order Logic: - E74(x) ⇒ E39(x)
label: E74 Groupe @fr
label: E74 Grupo @pt
label: E74 Menschliche Gruppe @de
label: E74 Ομάδα @el
label: E74 Группа @ru
label: E74 团体 @zh
subclass of: E39 Actor
subclass of: Restriction
  min cardinality: 2
  on property: P107 has current or former member
subclass of: Restriction
  min cardinality: 2
  on property: P144 gained member by
subclass of: Restriction
  min cardinality: 0
  on property: P146 lost member by
subclass of: Restriction
  max cardinality: 1
  on property: P95 was formed by
notation: E74

P160 is temporal projection of
type: ObjectProperty
type: NamedIndividual
comment: Quantification of the inverse property: many to one, necessary (1,1:0,n) Scope note of the inverse property: This property describes the temporal projection of an instance of E92 Spacetime Volume. The property P4 has time-span is the same as P160 has temporal projection if it is used to document an instance of E4 Period or any subclass of it. Examples of the inverse property: - The spatio-temporal trajectory of the H.M.S. Temeraire from its building in 1798 to its destruction in 1838 (E92) has temporal projection the time-span of the existence of H.M.S. Temeraire (E52) [at some time within (P82) “1798-1838” (E61).] (Willis, 2010) - The Battle of Waterloo 1815 (E7) has temporal projection the time-span of the Battle of Waterloo (E52) [at some time within (P82) “Sunday, 18(th) June 1815” (E61).] (Black, 2010) In First Order Logic of the inverse property: - P160(x,y) ⇒ E92(x) - P160(x,y)⇒ E52(y)
domain: E52 Time-Span
label: P160 est la projection temporelle de @fr
range: E92 Spacetime Volume
notation: P160i

P37 was assigned by
type: ObjectProperty
type: NamedIndividual
comment: Quantification of the inverse property: many to many (0,n:0,n) Scope note of the inverse property: This property records the identifier that was assigned to an item in an instance of E15 Identifier Assignment. The same identifier may be assigned on more than one occasion. An identifier might be created prior to an assignment. Examples of the inverse property: - The identifier assignment on 1(st) June 1997 of the silver cup donated by Martin Doerr (E15) assigned “232” (E42) (fictitious) In First Order Logic of the inverse property: - P37(x,y) ⇒ E15(x) - P37(x,y) ⇒ E42(y) - P37(x,y) ⇒ P141(x,y)
domain: E42 Identifier
label: P37 a été assigné par @fr
label: P37 foi atribuído por @pt
label: P37 wurde zugewiesen durch @de
label: P37 αποδόθηκε ως ιδιότητα από @el
label: P37 был присвоен посредством @ru
label: P37 被分配 @zh
range: E15 Identifier Assignment
sub property of: P141 was assigned by
notation: P37i

P44 is condition of
type: ObjectProperty
type: NamedIndividual
comment: Quantification of the inverse property: one to many, dependent (0,n:1,1) Scope note of the inverse property: This property records an E3 Condition State for some E18 Physical Thing. This property is a shortcut of the more fully developed path from E18 Physical Thing through P34i was assessed by, E14 Condition Assessment, P35 has identified to E3 Condition State. It offers no information about how and when the E3 Condition State was established, nor by whom. An instance of E3 Condition State is specific to an instance of E18 Physical Thing. Examples of the inverse property: - Silver cup 232 (E22) has condition oxidation traces were present in 1997 (E3). [which has type (P2) oxidation traces (E55)] (fictitious) In First Order Logic of the inverse property: - P44(x,y) ⇒ E18(x) - P44(x,y) ⇒ E3(y) - P44(x,y) ⇐ (∃z) [E14(z) ˄ P34i(x,z) ˄ P35(z,y)]
domain: E3 Condition State
label: P44 est l'état matériel de @fr
label: P44 estado material de @pt
label: P44 ist Zustand von @de
label: P44 είναι κατάσταση του @el
label: P44 является условием для @ru
label: P44 是状况 @zh
range: E18 Physical Thing
notation: P44i

P128 is carried by
type: ObjectProperty
type: NamedIndividual
comment: Quantification of the inverse property: many to many (0,n:0,n) Scope note of the inverse property: This property identifies an instance E90 Symbolic Object carried by an instance of E18 Physical Thing. Since an instance of E90 Symbolic Object is defined as an immaterial idealization over potentially multiple carriers, any individual realization on a particular physical carrier may be defective, due to deterioration or shortcomings in the process of creating the realization compared to the intended ideal. As long as such defects do not substantially affect the complete recognition of the respective symbolic object, it is still regarded as carrying an instance of this E90 Symbolic Object. If these defects are of scholarly interest, the particular realization can be modelled as an instance of E25 Human-Made Feature. Note, that any instance of E90 Symbolic Object incorporated (P165) in the carried symbolic object is also carried by the same instance of E18 Physical Thing. Examples of the inverse property: - Matthew’s paperback copy of Reach for the Sky (E18) carries the text of Reach for the Sky (E73). [see also: (Brickhill, 2001)] (fictitious) In First Order Logic of the inverse property: - P128(x,y) ⇒ E18(x) - P128(x,y) ⇒ E90(y) - P128(x,y) ⇒ P130(x,y)
domain: E90 Symbolic Object
label: P128 a pour support @fr
label: P128 wird getragen von @de
label: P128 é suportado por @pt
label: P128 φέρεται από @el
label: P128 переносится посредством @ru
label: P128 被承载 @zh
range: E18 Physical Thing
sub property of: P130 features are also found on
notation: P128i

P171 at some place within
type: DatatypeProperty
type: NamedIndividual
comment: Quantification: many to many (0,n:0,n) Scope note: This property describes the maximum spatial extent within which an instance of E53 Place falls. Since instances of E53 Places may not have precisely known spatial extents, the CIDOC CRM supports statements about maximum spatial extents of instances of E53 Place. This property allows an instance of E53 Place’s maximum spatial extent (i.e., its outer boundary) to be assigned an instance of E94 Space Primitive value. This property is a shortcut of the fully developed path from E53 Place, P89 falls within, E53 Place, P168 place is defined by to E94 Space Primitive through a declarative Place that is not explicitly documented, to a Space Primitive: declarative places are defined in CRMgeo (Doerr and Hiebel 2013). Examples: - The spatial extent of the Acropolis of Athens (E53) at some place within POLYGON ((37.969172 23.720787, 37.973122 23.721495 37.972741 23.728994, 37.969299 23.729735, 37.969172 23.720787)) (E94). In First Order Logic: - P171(x,y) ⇒ E53(x) - P171(x,y) ⇒ E94(y) - P171(x,y) ⇔ (∃z) [E53(z) ˄ P89(x,z) ˄ P168(z,y)]
domain: E53 Place
label: P171 quelque part dans @fr
notation: P171

P95 has formed
type: ObjectProperty
type: NamedIndividual
comment: Quantification: one to many, necessary, dependent (1,n:1,1) Scope note: This property associates the instance of E66 Formation with the instance of E74 Group that it founded. Examples: - The formation of the CIDOC CRM SIG at the August 2000 CIDOC Board meeting (E66) has formed the CIDOC CRM Special Interest Group (E74). In First Order Logic: - P95(x,y) ⇒ E66(x) - P95(x,y) ⇒ E74(y) - P95(x,y) ⇒ P92(x,y)
domain: E66 Formation
label: P95 a fondé @fr
label: P95 formou @pt
label: P95 hat gebildet @de
label: P95 σχημάτισε @el
label: P95 сформировал @ru
label: P95 已经组成 @zh
range: E74 Group
sub property of: P92 brought into existence
inverse of: P95 was formed by
notation: P95

P130 features are also found on
type: ObjectProperty
type: NamedIndividual
comment: Quantification of the inverse property: many to many (0,n:0,n) Scope note of the inverse property: This property generalises the notions of “copy of” and “similar to” into a directed relationship, where the domain expresses the derivative or influenced item and the range the source or influencing item, if such a direction can be established. The property can also be used to express similarity in cases that can be stated between two objects only, without historical knowledge about its reasons. The property expresses a symmetric relationship in case no direction of influence can be established either from evidence on the item itself or from historical knowledge. This holds in particular for siblings of a derivation process from a common source or non-causal cultural parallels, such as some weaving patterns. The P130.1 kind of similarity property of the P130 shows features of (features are also found on) property enables the relationship between the domain and the range to be further clarified, in the sense from domain to range, if applicable. For example, it may be expressed if both items are product “of the same mould”, or if two texts “contain identical paragraphs”. If the reason for similarity is a sort of derivation process, i.e. that the creator has used or had in mind the form of a particular thing during the creation or production, this process should be explicitly modelled. In these cases, P130 shows features of can be regarded as a shortcut of such a process. However, the current model does not contain any path specific enough to infer this property. Specializations of the CIDOC CRM may however be more explicit, for instance describing the use of moulds etc. This property is not transitive. This property is irreflexive. Examples of the inverse property: - Mary Lamb’s Cymbeline from Charles and Mary Lamb’s Tales from Shakespeare (E89) shows features of William Shakespeare’s Cymbeline (E89). (Carrington, 1954) - The audio recording of Dante Alighieri’s La divin…
domain: E70 Thing
label: P130 Merkmale auch auf @de
label: P130 a les caractéristiques aussi présentes sur @fr
label: P130 características são também encontradas em @pt
label: P130 χαρακτηριστικά του βρίσκονται επίσης σε @el
label: P130 признаки также найдены на @ru
label: P130 发现特征 @zh
range: E70 Thing
notation: P130i

P179 had sales price
type: ObjectProperty
type: NamedIndividual
comment: Quantification: many to many (1,n:0,n) Scope note: This property establishes the relationship between an instance of E96 Purchase and the instance of E97 Monetary Amount that forms the compensation for the transaction. The monetary amount agreed upon may change in the course of the purchase activity. Examples: - The sale of Vincent van Gogh’s “Still Life: Vase with Fifteen Sunflowers” 30(th) March 1987 (E96) had sales price Christie’s hammer price for “Still Life: Vase with Fifteen Sunflowers” (E97). - The purchase of 10 okka of nails by the captain A. Syrmas on 18(th) September 1895 (E96) had sales price 20 piastre (grosi) (E97). (Syrmas, 1896) In First Order Logic: - P179(x,y) ⇒ E96(x) - P179(x,y) ⇒ E97(y)
domain: E96 Purchase
label: P179 a eu pour prix de vente @fr
range: E97 Monetary Amount
inverse of: P179 was sales price of
notation: P179

P126 was employed in
type: ObjectProperty
type: NamedIndividual
comment: Quantification of the inverse property: many to many (0,n:0,n) Scope note of the inverse property: This property identifies the instance of E57 Material employed in an instance of E11 Modification. The instance of E57 Material used during the instance of E11 Modification does not necessarily become incorporated into the instance of E24 Physical Human-Made Thing that forms the subject of the instance of E11 Modification. Examples of the inverse property: - The repairing of the Queen Mary (E11) employed Steel (E57). [Beginning October 1942] (Britton, 2012) - Distilled water (E57) was employed in the restoration of the Sistine Chapel (E11). (Pietrangeli, 1986) In First Order Logic of the inverse property: - P126(x,y) ⇒ E11(x) - P126(x,y) ⇒ E57(y)
domain: E57 Material
label: P126 a été employé dans @fr
label: P126 foi empregado em @pt
label: P126 wurde verwendet bei @de
label: P126 χρησιμοποιήθηκε σε @el
label: P126 использовался в @ru
label: P126 被用于 @zh
range: E11 Modification
notation: P126i

P89 falls within
type: ObjectProperty
type: TransitiveProperty
type: NamedIndividual
comment: Quantification: many to many, necessary, dependent (1,n:1,n) Scope note: This property identifies an instance of E53 Place that falls wholly within the extent of another instance of E53 Place. It addresses spatial containment only and does not imply any relationship between things or phenomena occupying these places. This property is transitive and reflexive. Examples: - The area covered by the World Heritage Site of Stonehenge (E53) falls within the area of Salisbury Plain (E53). (Pryor, 2016) In First Order Logic: - P89(x,y) ⇒ E53(x) - P89(x,y) ⇒ E53(y) - [P89(x,y) ∧ P89(y,z)] ⇒ P89(x,z) - P89(x,x)
domain: E53 Place
label: P89 está contido em @pt
label: P89 fällt in @de
label: P89 s'insère dans @fr
label: P89 περιέχεται σε @el
label: P89 содержится в @ru
label: P89 位于 @zh
range: E53 Place
inverse of: P89 contains
notation: P89

P70 documents
type: ObjectProperty
type: NamedIndividual
comment: Quantification: many to many, necessary (1,n:0,n) Scope note: This property describes the CRM Entities documented as instances of E31 Document. Documents may describe any conceivable entity, hence the link to the highest-level entity in the CIDOC CRM class hierarchy. This property is intended for cases where a reference is regarded as making a proposition about reality. This may be of a documentary character, in the scholarly or scientific sense, or a more general statement. Examples: - The ‘Catalogue of the Greek coins of Arabia, Mesopotamia and Persia’ (E31) documents parts of the British Museum’s Collection (E78). (British Museum & Hill, 1922) In First Order Logic: - P70(x,y) ⇒ E31(x) - P70(x,y) ⇒ E1(y) - P70(x,y) ⇒ P67(x,y)
domain: E31 Document
label: P70 belegt @de
label: P70 documenta @pt
label: P70 documente @fr
label: P70 τεκμηριώνει @el
label: P70 документирует @ru
label: P70 记录了 @zh
range: E1 CRM Entity
sub property of: P67 refers to
inverse of: P70 is documented in
notation: P70

P112 was diminished by
type: ObjectProperty
type: NamedIndividual
comment: Quantification of the inverse property: many to many, necessary (1,n:0,n) Scope note of the inverse property: This property identifies the instance of E18 Physical Thing that was diminished by an instance of E80 Part Removal. Although an instance of E80 Part removal activity normally concerns only one instance of E18 Physical Thing, it is possible to imagine circumstances under which more than one item might be diminished by a single instance of E80 Part Removal activity. Examples of the inverse property: - The coffin of Tut-Ankh-Amun (E22) was diminished by the opening of the coffin of Tut-Ankh-Amun (E80). (Carter, 2014) - The coral of the Cocos Islands (E20) was diminished by the removal of the Porite coral specimen by Charles Darwin (E80). (Natural History Museum, 2010, b) In First Order Logic of the inverse property: - P112(x,y) ⇒ E80(x) - P112(x,y) ⇒ E18(y) - P112(x,y) ⇒ P31(x,y)
domain: E18 Physical Thing
label: P112 a été diminué par @fr
label: P112 foi diminuído por @pt
label: P112 wurde vermindert durch @de
label: P112 εξαλείφθηκε από @el
label: P112 был уменьшен посредством @ru
label: P112 被减少 @zh
range: E80 Part Removal
sub property of: P31 was modified by
notation: P112i

P71 is listed in
type: ObjectProperty
type: NamedIndividual
comment: Quantification of the inverse property: many to many (0,n:0,n) Scope note of the inverse property: This property associates an instance of E32 Authority Document with an instance of E1 CRM Entity which it lists for reference purposes. Examples of the inverse property: - The Art & Architecture Thesaurus (E32) lists alcazars (E55). (http://vocab.getty.edu/page/aat/300006897) In First Order Logic of the inverse property: - P71(x,y) ⇒ E32(x) - P71(x,y) ⇒ E1(y) - P71(x,y) ⇒ P67(x,y)
domain: E1 CRM Entity
label: P71 est énuméré par @fr
label: P71 wird aufgelistet in @de
label: P71 é definido por @pt
label: P71 περιλαμβάνεται σε @el
label: P71 перечислен в @ru
label: P71 列于 @zh
range: E32 Authority Document
sub property of: P67 is referred to by
notation: P71i

P1 identifies
type: ObjectProperty
type: NamedIndividual
comment: Quantification of the inverse property: many to many (0,n:0,n) Scope note of the inverse property: This property describes the naming or identification of any real-world item by a name or any other identifier. This property is intended for identifiers in general use, which form part of the world the model intends to describe, and not merely for internal database identifiers which are specific to a technical system, unless these latter also have a more general use outside the technical context. This property includes in particular identification by mathematical expressions such as coordinate systems used for the identification of instances of E53 Place. The property does not reveal anything about when, where and by whom this identifier was used. A more detailed representation can be made using the fully developed (i.e. indirect) path through E15 Identifier Assignment. This property is a shortcut for the path from E1 CRM Entity through P140i was attributed by, E15 Identifier Assignment, P37 assigned to E42 Identifier. It is also a shortcut for the path from E1 CRM Entity through P1 is identified by, E41 Appellation, P139 has alternative form to E41 Appellation. Examples of the inverse property: - The capital of Italy (E53) is identified by “Rome” (E41). (Leach, 2017) - Text 25014–32 (E33) is identified by “The Decline and Fall of the Roman Empire” (E35). (Gibbon, 2013) In First Order Logic of the inverse property: - P1(x,y) ⇒ E1(x) - P1(x,y) ⇒ E41(y) - P1(x,y) ⇐ (∃z) [E15(z)˄ P140i(x,z) ˄ P37(z,y)] - P1(x,y) ⇐ (∃z) [E41(z)˄ P1(x,z) ˄ P139(z,y)]
domain: E41 Appellation
label: P1 bezeichnet @de
label: P1 identifica @pt
label: P1 identifie @fr
label: P1 είναι αναγνωριστικό @el
label: P1 идентифицирует @ru
label: P1 标识 @zh
range: E1 CRM Entity
notation: P1i

P99 was dissolved by
type: ObjectProperty
type: NamedIndividual
comment: Quantification of the inverse property: one to many, necessary (1,n:0,n) Scope note of the inverse property: This property associates the instance of E68 Dissolution with the instance of E74 Group that it disbanded. Examples of the inverse property: - The end of The Hole in the Wall Gang (E68) dissolved The Hole in the Wall Gang (E74). (Patterson, 1998) In First Order Logic of the inverse property: - P99(x,y) ⇒ E68(x) - P99(x,y) ⇒ E74(y) - P99(x,y) ⇒ P11(x,y) - P99(x,y) ⇒ P93(x,y)
domain: E74 Group
label: P99 a été dissous par @fr
label: P99 foi dissolvido por @pt
label: P99 wurde aufgelöst durch @de
label: P99 διαλύθηκε από @el
label: P99 был распущен посредством @ru
label: P99 被解散 @zh
range: E68 Dissolution
sub property of: P11 participated in
sub property of: P93 was taken out of existence by
notation: P99i

P187 has production plan
type: ObjectProperty
type: NamedIndividual
comment: Quantification: one to many, necessary (1,n:0,1) Scope note: This property associates an instance of E99 Product Type with an instance of E29 Design or Procedure that completely determines the production of instances of E18 Physical Thing. The resulting instances of E18 Physical Thing are considered exemplars of this instance of E99 Product Type when the process specified is correctly executed. Note that the respective instance of E29 Design or Procedure may not necessarily be fixed in a written/graphical form, and may require the use of tools or models unique to the product type. The same instance of E99 Product Type may be associated with several variant plans. Examples: - Volkswagen Type 11 (Beetle) (E99) has production plan the production plans for Volkswagen Type 11 (Beetle) (E29). (Rieger, 2013) In First Order Logic: - P187(x,y) ⇒ E99(x) - P187(x,y) ⇒ E29(y)
domain: E99 Product Type
label: P187 a pour plan de production @fr
range: E29 Design or Procedure
inverse of: P187 is production plan for
notation: P187

P40 was observed in
type: ObjectProperty
type: NamedIndividual
comment: Quantification of the inverse property: many to many, necessary (1,n:0,n) Scope note of the inverse property: This property records the dimension that was observed in an E16 Measurement Event. E54 Dimension can be any quantifiable aspect of E70 Thing. Weight, image colour depth and monetary value are dimensions in this sense. One measurement activity may determine more than one dimension of one object. Dimensions may be determined either by direct observation or using recorded evidence. In the latter case the measured Thing does not need to be present or extant. Even though knowledge of the value of a dimension requires measurement, the dimension may be an object of discourse prior to, or even without, any measurement being made. Examples of the inverse property: - The measurement of the height of silver cup 232 on 31(st) August 1997 (E16) observed dimension silver cup 232 height (E54). [which has unit mm (E58), has value 224 (E60)] (fictitious) - The carbon 14 dating of the “Schoeninger Speer II” in 1996 (E16) observed dimension the carbon 14 based temporal distance from 1996 to the growth of the wood of the “Schoeninger Speer II” (E60). [The carbon 14 dating of an approximately 400.000 year old complete Old Palaeolithic wooden spear found in Schoeningen, Niederachsen, Germany, in 1995. See also: E16 Measurement.] (Kouwenhoven, 1997) In First Order Logic of the inverse property: - P40(x,y) ⇒ E16(x) - P40(x,y)⇒ E54(y) - P40(x,y) ⇒ P141(x,y)
domain: E54 Dimension
label: P40 a été relevé par @fr
label: P40 foi verificada durante @pt
label: P40 wurde beobachtet in @de
label: P40 παρατηρήθηκε από @el
label: P40 наблюдался в @ru
label: P40 被观测 @zh
range: E16 Measurement
sub property of: P141 was assigned by
notation: P40i

P102 is title of
type: ObjectProperty
type: NamedIndividual
comment: Quantification of the inverse property: many to many (0,n:0,n) Scope note of the inverse property: This property associates an instance of E35 Title that has been applied to an instance of E71 Human-Made Thing. The P102.1 has type property of the P102 has title (is title of) property enables the relationship between the title and the thing to be further clarified, for example, if the title was a given title, a supplied title etc. It allows any human-made material or immaterial thing to be given a title. It is possible to imagine a title being created without a specific object in mind. Examples of the inverse property: - The first book of the Old Testament (E33) has title “Genesis” (E35) has type translated title (E55) (E55). (Brueggemann, 1982) - Monet’s painting from 1868-1869 held by Musée d’Orsay, Paris, under inventory number RF 1984 164 (E22) has title “La Pie” (E35) has type creator’s title (E55). (Musée d’Orsay, 2020) - Monet’s painting from 1868-1869 held by Musée d'Orsay, Paris, under inventory number RF 1984 164 (E22) has title “The Magpie” (E35) has type translated title (E55). (Musée d'Orsay, 2020) In First Order Logic of the inverse property: - P102(x,y) ⇒ E71(x) - P102(x,y) ⇒ E35(y) - P102(x,y,z) ⇒ [P102(x,y) ∧ E55(z)] - P102(x,y) ⇒ P1(x,y)
domain: E35 Title
label: P102 est le titre de @fr
label: P102 ist der Titel von @de
label: P102 é título de @pt
label: P102 είναι τίτλος του/της @el
label: P102 является заголовком для @ru
label: P102 题名是 @zh
range: E71 Human-Made Thing
sub property of: P1 identifies
notation: P102i

P141 assigned
type: ObjectProperty
type: NamedIndividual
comment: Quantification: many to many (0,n:0,n) Scope note: This property associates an instance of E13 Attribute Assignment with the instance of E1 CRM Entity used in the attribution. The instance of E1 CRM Entity here plays the role of the range of the attribution. The kind of attribution made should be documented using P177 assigned property of type (is type of property assigned). Examples: - The Current Ownership Assessment of Martin Doerr’s silver cup February 1997 (E13) assigned Martin Doerr (E21). (fictitious) - The Identifier Assignment on 1(st) June 1997 of the silver cup donated by Martin Doerr (E15) assigned 232 (E42). (fictitious) - The examination of MS Sinai Greek 418 (E13) assigned unsupported (E55.) (Honey & Pickwoad, 2010) In First Order Logic: - P141(x,y) ⇒ E13(x) - P141(x,y) ⇒ E1(y)
domain: E13 Attribute Assignment
label: P141 a attribué @fr
label: P141 atribuiu @pt
label: P141 wies zu @de
label: P141 απέδωσε @el
label: P141 присвоил @ru
label: P141 分配 @zh
range: E1 CRM Entity
inverse of: P141 was assigned by
notation: P141

P167 was within
type: ObjectProperty
type: NamedIndividual
comment: Quantification: many to many, necessary (1,n:0,n) Scope note: This property associates an instance of E93 Presence with an instance of E53 Place that geometrically includes the spatial projection of the respective instance of E93 Presence. Besides others, this property may be used to state in which space an object has been for some known time, such as a room of a castle or in a drawer. It may also be used to describe a confinement of the spatial extent of some realm during a known time-span. This property is a shortcut of the more fully developed path from E93 Presence through P161 has spatial projection, E53 Place, P89 falls within (contains) to E53 Place. Examples: - Johann Joachim Winckelmann’s whereabouts in December 1755 (E93) was within Rome (E53). (Leppmann, 1970) - Johann Joachim Winckelmann’s whereabouts from 19(th) November 1755 until 9(th) April 1768 (E93) was within Italy (E53). (Leppmann, 1970) In First Order Logic: - P167(x,y) ⇒ E93(x) - P167(x,y) ⇒ E53(y) - P167(x,y) ⇔ (∃z) [E53(z) ˄ P161(x,z) ˄ P89(z,y)]
domain: E93 Presence
label: P167 s’inscrivait dans @fr
range: E53 Place
inverse of: P167 includes
notation: P167

P161 has spatial projection
type: ObjectProperty
type: NamedIndividual
comment: Quantification: many to many, necessary (1,n:0,n) Scope note: This property associates an instance of E92 Spacetime Volume with an instance of E53 Place that is the result of the spatial projection of the instance of the E92 Spacetime Volume on a reference space. In general, there can be more than one useful reference space (for reference space see P156 occupies and P157 is at rest relative to) to describe the spatial projection of a spacetime volume, for example, in describing a sea battle, the difference between the battle ship and the seafloor as reference spaces. Thus, it can be seen that the projection is not unique. The spatial projection is the actual spatial coverage of a spacetime volume, which normally has fuzzy boundaries except for instances of E92 Spacetime Volume which are geometrically defined in the same reference system as the range of this property and are an exception to this and do not have fuzzy boundaries. Modelling explicitly fuzzy spatial projections serves therefore as a common topological reference of different spatial approximations rather than absolute geometric determination, for instance for relating outer or inner spatial boundaries for the respective spacetime volumes. The spatial projection is unique with respect to the reference system. For instance, there is exactly one spatial projection of Lord Nelson’s dying relative to the ship HMS Victory, i.e. the location of his body relative to the ship HMS Victory at the time of his death. In case the domain of an instance of P161 has spatial projection is an instance of E4 Period, the spatial projection describes all areas that period was ever present at, for instance, the Roman Empire. This property is part of the fully developed path from E18 Physical Thing through P196 defines, E92 Spacetime Volume, P161 has spatial projection to E53 Place, which in turn is implied by P156 occupies (is occupied by). Examples: - The Roman Empire (E4) has spatial projection all areas ever claimed by Rome…
domain: E92 Spacetime Volume
label: P161 a pour projection spatiale @fr
range: E53 Place
inverse of: P161 is spatial projection of
notation: P161

P103 was intention of
type: ObjectProperty
type: NamedIndividual
comment: Quantification of the inverse property: many to many (0,n:0,n) Scope note of the inverse property: This property links an instance of E71 Human-Made Thing to an instance of E55 Type of usage or audience. It creates a relation between specific human-made things, both physical and immaterial, to E55 Types. This property can be used to specify intended methods and techniques of use or to characterise the intended audience by indicating a type of personal characteristic that everyone falling into the target audience has. Note: A link between specific human-made things and a specific use activity should be expressed using P19 was intended use of (was made for). Examples of the inverse property: - This plate (E22) was intended for being destroyed at wedding reception (E55). (fictitious) - “Reading for life, a first book for adults and their tutors” (E28) was intended for adult literacy learners in the English language (E55). (Allen, 1987) - “Piglet has a bath” (E28), published on sealed plastic pages, was intended for young children having a bath (E55). (Milne & Shepard, 1998) In First Order Logic of the inverse property: - P103(x,y) ⇒ E71(x) - P103(x,y) ⇒ E55(y)
domain: E55 Type
label: P103 a été la raison d'être de @fr
label: P103 era a destinação de @pt
label: P103 war Bestimmung von @de
label: P103 ήταν προορισμός του @el
label: P103 был интенцией для @ru
label: P103 目的是 @zh
range: E71 Human-Made Thing
notation: P103i

P51 is former or current owner of
type: ObjectProperty
type: NamedIndividual
comment: Quantification of the inverse property: many to many (0,n:0,n) Scope note of the inverse property: This property identifies an instance of E39 Actor that is or had been the legal owner (i.e. title holder) of an instance of E18 Physical Thing at some time. The distinction with P52 has current owner (is current owner of) is that P51 has former or current owner (is former or current owner of) does not indicate whether the specified owners are current. This property is a shortcut for the more detailed path from E18 Physical Thing through P24i changed ownership through, E8 Acquisition, P23 transferred title from, or P22 transferred title to to E39 Actor. Examples of the inverse property: - The paintings from the Iveagh Bequest (E78) has former or current owner Lord Iveagh (E21). (Bryant, 1990) In First Order Logic of the inverse property: - P51(x,y) ⇒ E18(x) - P51(x,y) ⇒ E39(y) - P51(x,y) ⇐ (∃z) [E8(z) ˄ P24i(x,z) ˄ [P23(z,y) ˅ P22(z,y) ]]
domain: E39 Actor
label: P51 est l’actant propriétaire actuel ou antérieur de @fr
label: P51 ist früherer oder derzeitiger Besitzer von @de
label: P51 é ou foi proprietário de @pt
label: P51 είναι ή ήταν ιδιοκτήτης του/της @el
label: P51 является бывшим или текущим владельцем для @ru
label: P51 是以往或当前所有者 @zh
range: E18 Physical Thing
notation: P51i

P53 has former or current location
type: ObjectProperty
type: NamedIndividual
comment: Quantification: many to many, necessary (1,n:0,n) Scope note: This property identifies an instance of E53 Place as the former or current location of an instance of E18 Physical Thing. In the case of instances of E19 Physical Object, the property does not allow any indication of the Time-Span during which the instance of E19 Physical Object was located at this instance of E53 Place, nor if this is the current location. In the case of immobile objects, the Place would normally correspond to the Place of creation. This property is a shortcut. A more detailed representation can make use of the fully developed (i.e. indirect) path from E19 Physical Object, though, P25i moved by, E9 Move, P26 moved to or P27 moved from to E53 Place. Examples: - Silver cup 232 (E22) has former or current location Display Case 4, Room 23, Museum of Oxford (E53). (fictitious) In First Order Logic: - P53(x,y) ⇒ E18(x) - P53(x,y) ⇒ E53(y) - P53(x,y) ⇐ (∃z) [E9(z) ˄ P25i(x,z) ˄ [P26(z,y) ˅ P27(z,y)]]
domain: E18 Physical Thing
label: P53 a pour localisation actuelle ou antérieure @fr
label: P53 hat früheren oder derzeitigen Standort @de
label: P53 é ou foi localizada em @pt
label: P53 βρίσκεται ή βρισκόταν σε @el
label: P53 имеет текущее или бывшее местоположение @ru
label: P53 有之前或当前位置 @zh
range: E53 Place
inverse of: P53 is former or current location of
notation: P53

P186 produced thing of product type
type: ObjectProperty
type: NamedIndividual
comment: Quantification: many to many (0,n:0,n) Scope note: This property associates an instance of E12 Production with the instance of E99 Production Type, that is, the type of the things it produces. Examples: - The production activity of the Volkswagen factory related to the “Standard limousine Type II” during 1949-1953 (E12) produced thing of product type Volkswagen Type 11 (Beetle) (E99). (Rieger, 2013) In First Order Logic: - P186(x,y) ⇒ E12(x) - P186(x,y) ⇒ E99(y) - P186(x,y) ⇒ (∃z) [E24(z) ∧ P108(x,z) ∧ P2(z,y)]
domain: E12 Production
label: P186 a produit la chose du type @fr
range: E99 Product Type
inverse of: P186 is produced by
notation: P186

P28 custody surrendered by
type: ObjectProperty
type: NamedIndividual
comment: Quantification: many to many (0,n:0,n) Scope note: This property identifies the instance(s) of E39 Actor who surrender custody of an instance of E18 Physical Thing in an instance of E10 Transfer of Custody. The property will typically describe an Actor surrendering custody of an object when it is handed over to someone else’s care. On occasion, physical custody may be surrendered involuntarily, e.g. through accident, loss, or theft. In reality, custody is either transferred to someone or from someone, or both. Examples: - The Secure Deliveries Inc. crew (E74) surrendered custody through the delivery of the paintings by Secure Deliveries Inc. to the National Gallery (E10). In First Order Logic: - P28(x,y) ⇒ E10(x) - P28(x,y) ⇒ E39(y) - P28(x,y) ⇒ P14(x,y)
domain: E10 Transfer of Custody
label: P28 a mis fin à la garde par @fr
label: P28 custódia concedida por @pt
label: P28 übergab Gewahrsam an @de
label: P28 μετεβίβασε κατοχή από @el
label: P28 опека отдана @ru
label: P28 监护权转自 @zh
range: E39 Actor
sub property of: P14 carried out by
inverse of: P28 surrendered custody through
notation: P28

P107 has current or former member
type: ObjectProperty
type: NamedIndividual
comment: Quantification: many to many (0,n:0,n) Scope note: This property associates an instance of E74 Group with an instance of E39 Actor that is or has been a member thereof. Instances of E74 Group and E21 Person may all be members of instances of E74 Group. An instance of E74 Group may be founded initially without any member. This property is a shortcut of the more fully developed path from E74 Group, P144i gained member by, E85 Joining, P143 joined to E39 Actor. The property P107.1 kind of member can be used to specify the type of membership or the role the member has in the group. Examples: - László Moholy-Nagy (E21) is current or former member of Bauhaus (E74). (Moholy-Nagy, 2012) - National Museum of Science and Industry (E74) has current or former member The National Railway Museum (E74). (Rolt, 1971) - The married couple Queen Elisabeth and Prince Phillip (E74) has current or former member Prince Phillip (E21) kind of member husband (E55). (Brandreth, 2004) Properties: - P107.1 kind of member: E55 Type In First Order Logic: - P107(x,y) ⇒ E74(x) - P107(x,y) ⇒ E39(y) - P107(x,y,z) ⇒ [P107(x,y) ∧ E55(z)] - P107(x,y) ⇐ (∃z) [E85(z) ˄ P144i(x,z) ˄ P143(z,y)]
domain: E74 Group
label: P107 a pour membre actuel ou antérieur @fr
label: P107 hat derzeitiges oder früheres Mitglied @de
label: P107 tem ou teve membro @pt
label: P107 έχει ή είχε μέλος @el
label: P107 имеет действующего или бывшего члена @ru
label: P107 有当前或以往成员 @zh
range: E39 Actor
inverse of: P107 is current or former member of
notation: P107

P49 is former or current keeper of
type: ObjectProperty
type: NamedIndividual
comment: Quantification of the inverse property: many to many (0,n:0,n) Scope note of the inverse property: This property identifies the instance of E39 Actor who has or has had custody of an instance of E18 Physical Thing at some time. This property leaves open the question if parts of this physical thing have been added or removed during the time-spans it has been under the custody of this actor, but it is required that at least a part which can unambiguously be identified as representing the whole has been under this custody for its whole time. The way, in which a representative part is defined, should ensure that it is unambiguous who keeps a part and who the whole and should be consistent with the identity criteria of the kept instance of E18 Physical Thing. The distinction with P50 has current keeper (is current keeper of) is that P49 has former or current keeper (is former or current keeper of) leaves open the question as to whether the specified keepers are current. This property is a shortcut for the more detailed path from E18 Physical Thing through P30i custody transferred through, E10 Transfer of Custody, P28 custody surrendered by or P29 custody received by to E39 Actor. Examples of the inverse property: - The paintings from The Iveagh Bequest (E78) has former or current keeper Secure Deliveries Inc. (E74). In First Order Logic of the inverse property: - P49(x,y) ⇒ E18(x) - P49(x,y) ⇒ E39(y) - P49(x,y) ⇐ (∃z) [E10(z) ˄ P30i(x,z) ˄ [P28(z,y) ˅ P29(z,y) ]]
domain: E39 Actor
label: P49 est l’actant détenteur actuel ou antérieur de @fr
label: P49 ist früherer oder derzeitiger Betreuer von @de
label: P49 é ou foi guardador de @pt
label: P49 κατέχει ή κατείχε @el
label: P49 является бывшим или текущим смотрителем для @ru
label: P49 是以往或当前保管者 @zh
range: E18 Physical Thing
notation: P49i

P183 ends before the start of
type: ObjectProperty
type: TransitiveProperty
type: NamedIndividual
comment: Quantification: many to many (0,n:0,n) Scope note: This property specifies that the temporal extent of the domain instance A of E2 Temporal Entity ends definitely before the start of the temporal extent of the range instance B of E2 Temporal Entity. In other words, if A = [A(start), A(end)] and B = [B(start), B(end)], it means A(end) < B(start) is true. This property is part of the set of temporal primitives P173 – P176, P182 – P185. This property corresponds to the following Allen temporal relation (Allen, 1983) : {before}. This property is transitive. This property is asymmetric. https://cidoc-crm.org/html/version_images/images_7.1.3/image_11.png Figure 18: Temporal entity A ends before the start of temporal entity B. Here A is longer than B https://cidoc-crm.org/html/version_images/images_7.1.3/image_12.png Figure 19: Temporal entity A ends before the start of temporal entity B. Here A is shorter than B Examples: - Gisle taking office as Bishop of Linköping 1139 AD (E7) ends before the start of The Guta saga composition (E65). (Peel, 1999) - Troy VII (E4) ends before the start of Troy VIII (E4). [uninhabited for some 200 years] - The use of the Tomb Four from Nikitopoulou group in Nihoria in the MHIII-LHI period (E4) ends before the start of the period of reuse of the Tomb Four from Nikitopoulou group in LHIIIA (E4). [“Of the six tombs excavated in the Nikitopoulou group […] the finds in Tomb Four are of MH II or MH III-LH I date, with the exception of the finds with the Northern group of material, which is uniformly dated to LHIIA2, end the ewer in the middle of the floor, dated LHIIIA1. […] The preserved evidence seems clearly to indicate use in the MHIII-LHI use in the MHIII-LHI period followed by a period of reuse in LHIIIA, a pattern matched at architecturally similar sites such as 13:Kaminia and 10:Gouvalári.”] (Boyd, 2002) In First Order Logic: - P183(x,y) ⇒ E2(x) - P183(x,y) ⇒ E2(y) - P183(x,y) ⇒ P182(x,y) - [P183(x,y) ∧ P183(y,z)] ⇒ P183(x,z) - P183(x,y)…
domain: E2 Temporal Entity
label: P183 se termine avant le début de @fr
range: E2 Temporal Entity
sub property of: P182 ends before or with the start of
inverse of: P183 starts after the end of
notation: P183

P5 forms part of
type: ObjectProperty
type: TransitiveProperty
type: NamedIndividual
comment: Quantification of the inverse property: many to many (0,n:0,n) Scope note of the inverse property: This property describes the decomposition of an instance of E3 Condition State into discrete, subsidiary states. It is assumed that the sub-states into which the condition state is analysed form a logical whole, although the entire story may not be completely known, and that the sub-states are in fact constitutive of the general condition state. For example, a general condition state of “in ruins” may be decomposed into the individual stages of decay. This property is transitive and asymmetric. Examples of the inverse property: - The Condition State of the ruined Parthenon (E3) consists of the bombarded state after the explosion of a Venetian shell in 1687 (E3). (Mommsen, 1941) In First Order Logic of the inverse property: - P5(x,y) ⇒ E3(x) - P5(x,y) ⇒ E3(y) - [P5(x,y) ∧ P5(y,z)] ⇒ P5(x,z) - P5(x,y) ⇒ ¬P5(y,x)
domain: E3 Condition State
label: P5 bildet Teil von @de
label: P5 fait partie de @fr
label: P5 faz parte de @pt
label: P5 αποτελεί μέρος του/της @el
label: P5 формирует часть @ru
label: P5 组成部分 @zh
range: E3 Condition State
notation: P5i

E80 Part Removal
type: Class
type: NamedIndividual
comment: Scope note: This class comprises the activities that result in an instance of E18 Physical Thing being decreased by the removal of a part. Typical scenarios include the detachment of an accessory, the removal of a component or part of a composite object, or the deaccessioning of an object from a curated collection, an instance of E78 Curated Holding. If the instance of E80 Part Removal results in the total decomposition of the original object into pieces, such that the whole ceases to exist, the activity should instead be modelled as an instance of E81 Transformation, i.e. a simultaneous destruction and production. In cases where the part removed has no discernible identity prior to its removal but does have an identity subsequent to its removal, the activity should be modelled as both an instance of E80 Part Removal and E12 Production. This class of activities forms a basis for reasoning about the history, and continuity of identity over time, of objects that are removed from other objects, such as precious gemstones being extracted from different items of jewellery, or cultural artifacts being deaccessioned from different museum collections over their lifespan. Examples: - the removal of the Porite coral specimen from the Cocos Islands by Charles Darwin in April 1836 (Natural History Museum, 2021, b) - the removal of the engine from my car (fictitious) - the disposal of object number 1976:234 from the collection (fictitious) In First Order Logic: - E80(x) ⇒ E11(x)
label: E80 Remoção de Parte @pt
label: E80 Retrait d'élément @fr
label: E80 Teilentfernung @de
label: E80 Αφαίρεση Μερών @el
label: E80 Удаление Части @ru
label: E80 部分去除 @zh
subclass of: E11 Modification
subclass of: Restriction
  on property: P112 diminished
  some values from: E18 Physical Thing
subclass of: Restriction
  on property: P113 removed
  some values from: E18 Physical Thing
notation: E80

E99 Product Type
type: Class
type: NamedIndividual
comment: Scope note: This class comprises types that stand as the models for instances of E22 Human-Made Object that are produced as the result of production activities using plans exact enough to result in one or more series of uniform, functionally and aesthetically identical and interchangeable items. The product type is the intended ideal form of the manufacture process. It is typical of instances of E22 Human-Made Object that conform to an instance of E99 Product Type that its component parts are interchangeable with component parts of other instances of E22 Human-Made Object made after the model of the same instance of E99 Product Type. Frequently, the uniform production according to a given instance of E99 Product Type is achieved by creating individual tools, such as moulds or print plates that are themselves carriers of the design of the product type. Modern tools may use the flexibility of electronically controlled devices to achieve such uniformity. The product type itself, i.e. the potentially unlimited series of aesthetically equivalent items, may be the target of artistic design, rather than the individual object. In extreme cases, only one instance of a product type may have been produced, such as in a “print on demand” process which was only triggered once. However, this should not be confused with industrial prototypes, such as car prototypes, which are produced prior to the production line being set up, or test the production line itself. Examples: - Volkswagen Type 11 [Beetle] (Rieger, 2013) - Dragendorff 54 samian vessel - 1937 Edward VIII brass threepenny bit - Qin Crossbow trigger un-notched Part B (Bg2u) (Li, 2012) - Nokia Cityman 1320 [The first Nokia mobile phone] In First Order Logic: - E99(x) ⇒ E55(x)
label: E99 Modèle de produit @fr
subclass of: E55 Type
notation: E99

P27 moved from
type: ObjectProperty
type: NamedIndividual
comment: Quantification: many to many, necessary (1,n:0,n) Scope note: This property identifies an origin, an instance of E53 Place, of an instance of E9 Move. A move will be linked to an origin, such as the move of an artifact from storage to display. A move may be linked to many starting instances of E53 Place by multiple instances of this property. In this case the move describes the picking up of a set of objects. The area of the move includes the origin(s), route and destination(s). Therefore, the described origin is an instance of E53 Place which P89 falls within (contains) the instance of E53 Place the move P7 took place at. Examples: - The movement of the exhibition “Tutankhamun: Treasures of the Golden Pharaoh” between 15(th) September and 2(nd) November 2019 (E9) moved from Paris, Grande Halle de la Villette (E53). In First Order Logic: - P27(x,y) ⇒ E9(x) - P27(x,y) ⇒ E53(y) - P27(x,y) ⇒ (∃z) [E53(z) ∧ P7(x,z) ∧ P89(y,z)]
domain: E9 Move
label: P27 a déplacé depuis @fr
label: P27 bewegte weg von @de
label: P27 locomoveu de @pt
label: P27 μετακινήθηκε από @el
label: P27 перемещен из @ru
label: P27 移自 @zh
range: E53 Place
inverse of: P27 was origin of
notation: P27

E25 Human-Made Feature
type: Class
type: NamedIndividual
comment: Scope note: This class comprises physical features that are purposely created by human activity, such as scratches, artificial caves, artificial water channels, etc. In particular, it includes the information encoding features on mechanical or digital carriers. Examples: - the Manchester Ship Canal (Farnie, 1980) - Michael Jackson’s nose following plastic surgery - the laser-readable “pits” engraved June 2014 on Martin Doerr’s CD-R, copying songs of Edith Piaf - the carved letters on the Rosetta Stone In First Order Logic: - E25(x) ⇒ E24(x) - E25(x) ⇒ E26(x)
label: E25 Caractéristique élaborée par l'humain @fr
subclass of: E24 Physical Human-Made Thing
subclass of: E26 Physical Feature
notation: E25

P124 was transformed by
type: ObjectProperty
type: NamedIndividual
comment: Quantification of the inverse property: one to many, necessary (1,n:0,1) Scope note of the inverse property: This property identifies the instance or instances E18 Physical Thing that have ceased to exist due to an instance of E81 Transformation. The item that has ceased to exist and was replaced by the result of the Transformation. The continuity between both items, the new and the old, is expressed by the links to the common instance of E81 Transformation. Examples of the inverse property: - The transformation of the Venetian Loggia in Heraklion into a city hall (E81, E12) transformed the Venetian Loggia in Heraklion (E24). (Municipality of Heraklion, 2021) - The mummification of Tut-Ankh-Amun (E81, E12) transformed the deceased Pharaoh Tut-Ankh-Amun (E21). (Carter & Mace, 1977) - The death, carbonization and petrification of some people of Pompeii in 79AD by the intense heat of a pyroclastic cloud and ashes from the eruption of Mount Vesuvius (E69, E81) transformed some people of Pompeii (E21). [AND: was death of (P100) some people of Pompeii (E21).] In First Order Logic of the inverse property: - P124(x,y) ⇒ E81(x) - P124(x,y) ⇒ E18(y) - P124(x,y) ⇒ P93(x,y)
domain: E18 Physical Thing
label: P124 a été transformé par @fr
label: P124 foi transformado por @pt
label: P124 wurde umgewandelt durch @de
label: P124 μετατράπηκε από @el
label: P124 был трансформирован посредством @ru
label: P124 被转变 @zh
range: E81 Transformation
sub property of: P93 was taken out of existence by
notation: P124i

P69 has association with
type: ObjectProperty
type: NamedIndividual
comment: Quantification: many to many (0,n:0,n) Scope note: This property generalises relationships like whole-part, sequence, prerequisite or inspired by between instances of E29 Design or Procedure. Any instance of E29 Design or Procedure may be associated with other designs or procedures. The property is considered to be symmetrical unless otherwise indicated by P69.1 has type. The property is not transitive. This property is a directed relationship. The P69.1 has type property of P69 has association with allows the nature of the association to be specified reading from domain to range; examples of types of association between instances of E29 Design or Procedure include: has part, follows, requires, etc. Instances of this property are considered to be symmetric, in case no directed sense is provided for them by the property P69.1 has type. The property can typically be used to model the decomposition of the description of a complete workflow into a series of separate procedures. Examples: - The procedure for glass blowing (E29) has association with the procedure for glass heating (E29). (Brooks, 1973) - The set of instructions for performing Macbeth in Max Reinhardt's production in 1916 in Berlin at Deutsches Theater (E29) has association with the scene design drawing by Ernst Stern reproduced at http://www.glopad.org/pi/fr/record/digdoc/1003814 (E29) has type has part (E55). - The preparation of parchment (E29) has association with soaking and unhairing of skin (E29) has type has part (E55). - Stretching of skin (E29) has association with soaking and unhairing of skin (E29) has type follows (E55). (Poole and Reed, 1962) - The plan for reassembling the temples at Abu Simbel (E29) has association with the plan for storing and transporting the blocks (E29) has type follows (E55). (Loubiere, 1995) Properties: - P69.1 has type: E55 Type In First Order Logic: - P69(x,y) ⇒ E29(x) - P69(x,y) ⇒ E29(y) - P69(x,y,z) ⇒ [P69(x,y) ∧ E55(z)]
domain: E29 Design or Procedure
label: P69 est associé à @fr
label: P69 ist verbunden mit @de
label: P69 é associado com @pt
label: P69 σχετίζεται με @el
label: P69 ассоциирован с @ru
label: P69 关联 @zh
range: E29 Design or Procedure
inverse of: P69 is associated with
notation: P69

P164 is temporally specified by
type: ObjectProperty
type: NamedIndividual
comment: Quantification: many to one, necessary(1,1:0,n) Scope note: This property relates an instance of E93 Presence with the instance of E52 Time-Span that defines the time-slice of the spacetime volume that this instance of E93 Presence is related to via the property P166 was a presence of (had presence). There are two typical cases for the determination of the related instance of E52 Time-Span. In the first, it is the temporal extent of an instance of E2 Temporal Entity (documented with P4 has time-span (is time-span of)): this then documents the simultaneity of the instance of E93 Presence and the instance of E2 Temporal Entity, even if the absolute time-span is not known, and can be regarded as a phenomenal time-span. In the second, the instance of E52 Time-Span is a date range declared in or derived from historical sources or provided by dating methods: this is a declarative time-span. Examples: - 2016-02-09 (E52) temporally specifies the last day of the 2016 Carnival in Cologne (E93). - Johann Joachim Winckelmann’s whereabouts in December 1755 (E93) is temporally specified by December 1755 (E52.) (Leppmann, 1970) - Johann Joachim Winckelmann’s whereabouts from 19(th) November 1755 until 9(th) April 1768 (E93) is temporally specified by 19(th) November 1755 until 9(th) April 1768 (E52). (Leppmann, 1970) In First Order Logic: - P164(x,y) ⇒ E93(x) - P164(x,y) ⇒ E52(y) - P164(x,y) ⇒ P160(x,y)
domain: E93 Presence
label: P164 est temporellement spécifié par @fr
range: E52 Time-Span
sub property of: P160 has temporal projection
inverse of: P164 temporally specifies
notation: P164

P9 consists of
type: ObjectProperty
type: TransitiveProperty
type: NamedIndividual
comment: Quantification: many to many (0,n:0,n) Scope note: This property associates an instance of E4 Period with another instance of E4 Period that is defined by a subset of the phenomena that define the former. Therefore, the spacetime volume of the latter must fall within the spacetime volume of the former. This property is transitive and asymmetric. Examples: - Cretan Bronze Age (E4) consists of Middle Minoan (E4). (Hood, 1971) In First Order Logic: - P9(x,y) ⇒ E4(x) - P9(x,y) ⇒ E4(y) - P9(x,y) ⇒ P10(y,x) - [P9(x,y) ∧ P9(y,z)] ⇒ P9(x,z) - P9(x,y) ⇒ ¬P9(y,x)
domain: E4 Period
label: P9 comprend @fr
label: P9 consiste de @pt
label: P9 setzt sich zusammen aus @de
label: P9 αποτελείται από @el
label: P9 состоит из @ru
label: P9 包括 @zh
range: E4 Period
sub property of: P10 contains
inverse of: P9 forms part of
notation: P9

P43 is dimension of
type: ObjectProperty
type: NamedIndividual
comment: Quantification of the inverse property: one to many, dependent (0,n:1,1) Scope note of the inverse property: This property records an instance of E54 Dimension of some instance of E70 Thing. In the case that the recorded property is a result of a measurement of an instance of E18 Physical Thing, this property is a shortcut of the more fully developed path from E18 Physical Thing through P39i was measured by, E16 Measurement, P40 observed dimension to E54 Dimension. It offers no information about how and when an E54 Dimension was established, nor by whom. Knowledge about an instance of E54 Dimension need not be the result of a measurement; it may be the result of evaluating data or other information, which should be documented as an instance of E13 Attribute Assignment. An instance of E54 Dimension is specific to an instance of E70 Thing. Examples of the inverse property: - Silver cup 232 (E22) has dimension height of silver cup 232 (E54). [which has unit (P91) mm (E58), has value (P90) 224 (E60)] (fictitious) In First Order Logic of the inverse property: - P43(x,y) ⇒ E70(x) - P43(x,y) ⇒ E54(y) - P43(x,y) ⇐ (∃z) [E16(z) ˄ P39i(x,z) ˄ P40(z,y)]
domain: E54 Dimension
label: P43 est la dimension de @fr
label: P43 ist Dimension von @de
label: P43 é dimensão de @pt
label: P43 είναι μέγεθος του @el
label: P43 является величиной для @ru
label: P43 是度量规格 @zh
range: E70 Thing
notation: P43i

P100 was death of
type: ObjectProperty
type: NamedIndividual
comment: Quantification: one to many, necessary (1,n:0,1) Scope note: This property links an instance of E69 Death to the instance of E21 Person that died. An instance of E69 Death may involve multiple people, for example in the case of a battle or disaster. This is not intended for use with general natural history material, only people. Examples: - Mozart’s death (E69) was death of Mozart (E21). (Sitwell, 2017) In First Order Logic: - P100(x,y) ⇒ E69(x) - P100(x,y) ⇒ E21(y) - P100(x,y) ⇒ P93(x,y)
domain: E69 Death
label: P100 Tod von @de
label: P100 a été la mort de @fr
label: P100 foi a morte para @pt
label: P100 ήταν θάνατος του/της @el
label: P100 был смертью для @ru
label: P100 死亡的是 @zh
range: E21 Person
sub property of: P93 took out of existence
inverse of: P100 died in
notation: P100

P72 has language
type: ObjectProperty
type: NamedIndividual
comment: Quantification: many to many, necessary (1,n:0,n) Scope note: This property associates an instance(s) of E33 Linguistic Object with an instance of E56 Language in which it is, at least partially, expressed. Linguistic Objects are composed in one or more human languages. This property allows these languages to be documented. Examples: - The United States Declaration of Independence (E33) has language 18(th) Century English (E56). (Perley, 2017) In First Order Logic: - P72(x,y) ⇒ E33(x) - P72(x,y) ⇒ E56(y)
domain: E33 Linguistic Object
label: P72 a pour langue @fr
label: P72 hat Sprache @de
label: P72 é da língua @pt
label: P72 έχει γλώσσα @el
label: P72 имеет язык @ru
label: P72 有语种 @zh
range: E56 Language
inverse of: P72 is language of
notation: P72

P91 has unit
type: ObjectProperty
type: NamedIndividual
comment: Quantification: many to one, necessary (1,1:0,n) Scope note: This property shows the type of unit an instance of E54 Dimension was expressed in. Examples: - The height of silver cup 232 (E54) has unit mm (E58). (fictitious) In First Order Logic: - P91(x,y) ⇒ E54(x) - P91(x,y) ⇒ E58(y)
domain: E54 Dimension
label: P91 a pour unité de mesure @fr
label: P91 hat Einheit @de
label: P91 tem unidade @pt
label: P91 έχει μονάδα μέτρησης @el
label: P91 имеет единицу @ru
label: P91 有单位 @zh
range: E58 Measurement Unit
inverse of: P91 is unit of
notation: P91

P137 is exemplified by
type: ObjectProperty
type: NamedIndividual
comment: Quantification of the inverse property: many to many (0,n:0,n) Scope note of the inverse property: This property associates an instance of E1 CRM Entity with an instance of E55 Type for which it has been declared to be a particularly characteristic example. The P137.1 in the taxonomic role property of P137 exemplifies (is exemplified by) allows differentiation of taxonomic roles. The taxonomic role renders the specific relationship of this example to the type, such as “prototypical”, “archetypical”, “lectotype”, etc. The taxonomic role “lectotype” is not associated with the instance of E83 Type Creation itself but is selected in a later phase. Examples of the inverse property: - Object BM000098044 of the Clayton Herbarium (E20) exemplifies ‘Spigelia marilandica’ (L.) L. (E55) in the taxonomic role lectotype (E55). (Natural History Museum, 2021) In First Order Logic of the inverse property: - P137(x,y) ⇒ E1(x) - P137(x,y) ⇒ E55(y) - P137(x,y,z) ⇒ [P137(x,y) ∧ E55(z)] - P137(x,y) ⇒ P2(x,y)
domain: E55 Type
label: P137 erläutert durch Beispiel @de
label: P137 est exemplifié par @fr
label: P137 exemplifica @pt
label: P137 δειγματίζεται από @el
label: P137 поясняется посредством @ru
label: P137 被例示 @zh
range: E1 CRM Entity
sub property of: P2 is type of
notation: P137i

P146 separated from
type: ObjectProperty
type: NamedIndividual
comment: Quantification: many to many, necessary (1,n:0,n) Scope note: This property identifies the instance of E74 Group an instance of E39 Actor leaves through an instance of E86 Leaving. Although a leaving activity normally concerns only one instance of E74 Group, it is possible to imagine circumstances under which leaving one E74 Group implies leaving another E74 Group as well. Examples: - The end of Sir Isaac Newton’s duty as Member of Parliament for the University of Cambridge to the Convention Parliament in 1702 (E86) separated from the Convention Parliament (E74). (Iliffe, 2013) - George Washington’s leaving office in 1797 (E86) separated from the office of President of the United States (E74). (Unger, 2015) - The implementation of the treaty regulating the termination of Greenland membership in EU between EU, Denmark and Greenland 1(st) February 1985 (E86) separated from EU (E74). In First Order Logic: - P146(x,y) ⇒ E86(x) - P146(x,y) ⇒ E74(y) - P146(x,y) ⇒ P11(x,y)
domain: E86 Leaving
label: P146 a dissocié de @fr
label: P146 entließ von @de
label: P146 脱离 @zh
range: E74 Group
sub property of: P11 had participant
inverse of: P146 lost member by
notation: P146

P26 was destination of
type: ObjectProperty
type: NamedIndividual
comment: Quantification of the inverse property: many to many, necessary (1,n:0,n) Scope note of the inverse property: This property identifies a destination, an instance of E53 Place, of an instance of E9 Move. A move will be linked to a destination, such as the move of an artifact from storage to display. A move may be linked to many terminal instances of E53 Place by multiple instances of this property. In this case the move describes a distribution of a set of objects. The area of the move includes the origin(s), route and destination(s). Therefore, the described destination is an instance of E53 Place which P89 falls within (contains) the instance of E53 Place the move P7 took place at. Examples of the inverse property: - The movement of the exhibition “Tutankhamun: Treasures of the Golden Pharaoh” between 15(th) September and 2(nd) November 2019 (E9) moved to the Saatchi Gallery London (E53). In First Order Logic of the inverse property: - P26(x,y) ⇒ E9(x) - P26(x,y) ⇒ E53(y) - P26(x,y) ⇒ (∃z) [E53(z) ∧ P7(x,z) ∧ P89(y,z)]
domain: E53 Place
label: P26 a été la destination de @fr
label: P26 era destinação de @pt
label: P26 war Zielort von @de
label: P26 ήταν προορισμός του/της @el
label: P26 был пунктом назначения для @ru
label: P26 是目的地 @zh
range: E9 Move
notation: P26i

E26 Physical Feature
type: Class
type: NamedIndividual
comment: Scope note: This class comprises identifiable features that are physically attached in an integral way to particular physical objects. Instances of E26 Physical Feature share many of the attributes of instances of E19 Physical Object. They may have a one-dimensional, two-dimensional, or three-dimensional geometric extent, but there are no natural borders that separate them completely in an objective way from the carrier objects. For example, a doorway is a feature but the door itself, being attached by hinges, is not. Instances of E26 Physical Feature can be features in a narrower sense, such as scratches, holes, reliefs, surface colours, reflection zones in an opal crystal or a density change in a piece of wood. In the wider sense, they are portions of particular objects with partially imaginary borders, such as the core of the Earth, an area of property on the surface of the Earth, a landscape or the head of a contiguous marble statue. They can be measured and dated, and it is sometimes possible to state who or what is or was responsible for them. They cannot be separated from the carrier object, but a segment of the carrier object may be identified (or sometimes removed) carrying the complete feature. This definition coincides with the definition of “fiat objects”, with the exception of aggregates of “bona fide objects” (Smith & Varzi, 2000). Examples: - the cave of Dirou, Mani, Greece (Psimenos. 2005) - the temple in Abu Simbel before its removal, which was carved out of solid rock (E25) (Hawass, 2000) - Albrecht Duerer's signature on his painting of Charles the Great (E25) (Strauss, 1974) - the damage to the nose of the Great Sphinx in Giza (Temple, 2009) - Michael Jackson’s nose prior to plastic surgery In First Order Logic: - E26(x) ⇒ E18(x)
label: E26 Característica Material @pt
label: E26 Caractéristique physique @fr
label: E26 Materielles Merkmal @de
label: E26 Υλικό Μόρφωμα @el
label: E26 Физический Признак @ru
label: E26 物理特征 @zh
subclass of: E18 Physical Thing
subclass of: Restriction
  min cardinality: 1
  on property: P56 is found on
notation: E26

E36 Visual Item
type: Class
type: NamedIndividual
comment: Scope note: This class comprises the intellectual or conceptual aspects of recognisable marks and images. This class does not intend to describe the idiosyncratic characteristics of an individual physical embodiment of a visual item, but the underlying prototype. For example, a mark such as the ICOM logo is generally considered to be the same logo when used on any number of publications. The size, orientation, and colour may change, but the logo remains uniquely identifiable. The same is true of images that are reproduced many times. This means that visual items are independent of their physical support. The E36 Visual Item class provides a means of identifying and linking together instances of E24 Physical Human-Made Thing that carry the same visual symbols, marks, or images, etc. The property P62 depicts (is depicted by) between E24 Physical Human-Made Thing and the depicted subjects (E1 CRM Entity) can be regarded as a shortcut of the more fully developed path from E24 Physical Human-Made Thing through P65 shows visual item (is shown by), E36 Visual Item, P138 represents (has representation) to E1 CRM Entity, which in addition captures the optical features of the depiction. Examples: - the visual appearance of Monet’s “La Pie” (Bortolatto, 1981) - the Coca-Cola logo (E34) - the Chi-Rho (E37) - the communist red star (E37) - the surface shape of Auguste Rodin's statue "Le Penseur" [There exist more than 20 copies, even of different size. Therefore, this is a good example that it is only the common surface shape, an immaterial visual item, which justifies displaying these copies as works of Auguste Rodin. As usual practice, Rodin himself did not produce the bronze statue, but only the prototype model.] In First Order Logic: - E36(x) ⇒ E73(x)
label: E36 Bildliches @de
label: E36 Entité visuelle @fr
label: E36 Item Visual @pt
label: E36 Οπτικό Στοιχείο @el
label: E36 Визуальный Предмет @ru
label: E36 可视项 @zh
subclass of: E73 Information Object
notation: E36

E83 Type Creation
type: Class
type: NamedIndividual
comment: Scope note: This class comprises activities formally defining new types of items. It is typically a rigorous scholarly or scientific process that ensures a type is exhaustively described and appropriately named. In some cases, particularly in archaeology and the life sciences, E83 Type Creation requires the identification of an exemplary specimen and the publication of the type definition in an appropriate scholarly forum. The activity modelled as an instance of E83 Type Creation is central to research in the life sciences, where a type would be referred to as a “taxon,” the type description as a “protologue,” and the exemplary specimens as “original element” or “holotype”. Examples: - creation of the taxon Penicillium brefeldianum (Dodge, 1933) - addition of class E85 Joining to the CIDOC CRM In First Order Logic: - E83(x) ⇒ E65(x)
label: E83 Criação de Tipo @pt
label: E83 Création de type @fr
label: E83 Typuserfindung @de
label: E83 Δημιουργία Τύπου @el
label: E83 Создание Типа @ru
label: E83 类型创建 @zh
subclass of: E65 Creation
subclass of: Restriction
  on property: P135 created type
  some values from: E55 Type
notation: E83

P73 is translation of
type: ObjectProperty
type: NamedIndividual
comment: Quantification of the inverse property: many to many (0,n:0,n) Scope note of the inverse property: This property links an instance of E33 Linguistic Object (A), to another instance of E33 Linguistic Object (B) which is the translation of A. When an instance of E33 Linguistic Object is translated into a new language a new instance of E33 Linguistic Object is created, despite the translation being conceptually similar to the source. This property is asymmetric. Examples of the inverse property: - “Les Baigneurs” (E33) has translation “The Bathers” (E33). (Spiers & Surenne, 1854) In First Order Logic of the inverse property: - P73(x,y) ⇒ E33(x) - P73(x,y) ⇒ E33(y) - P73(x,y) ⇒ P130i(x,y) - P73(x,y) ⇒ ¬P73(y,x)
domain: E33 Linguistic Object
label: P73 est traduction de @fr
label: P73 ist Übersetzung von @de
label: P73 é tradução de @pt
label: P73 είναι μετάφραση του/της @el
label: P73 является переводом @ru
label: P73 是译文 @zh
range: E33 Linguistic Object
sub property of: P130 shows features of
notation: P73i

P81b begin of the end
type: DatatypeProperty
type: NamedIndividual
domain: E52 Time-Span
label: P81b Anfang vom Ende @de
label: P81b começar do fim @pt
label: P81b début de la fin @fr
label: P81b αρχή του τέλους @el
label: P81b начать в конце @ru
sub property of: P81 ongoing throughout
notation: P81b

P42 was assigned by
type: ObjectProperty
type: NamedIndividual
comment: Quantification of the inverse property: many to many, necessary (1,n:0,n) Scope note of the inverse property: This property records the type that was assigned to an entity by an E17 Type Assignment activity. Type assignment events allow a more detailed path from E1 CRM Entity through P41i was classified by, E17 Type Assignment, P42 assigned, to E55 Type for assigning types to objects compared to the shortcut offered by P2 has type (is type of). For example, a fragment of an antique vessel could be assigned the type “attic red figured belly handled amphora” by expert A. The same fragment could be assigned the type “shoulder handled amphora” by expert B. A Type may be intellectually constructed independent from assigning an instance of it. Examples of the inverse property: - The classification of silver cup 232 on 31(st) August 1997 (E17) assigned goblet (E55). (fictitious) In First Order Logic of the inverse property: - P42(x,y) ⇒ E17(x) - P42(x,y)⇒ E55(y) - P42(x,y) ⇒ P141(x,y)
domain: E55 Type
label: P42 a été assigné par @fr
label: P42 foi atribuído por @pt
label: P42 wurde zugewiesen durch @de
label: P42 αποδόθηκε από @el
label: P42 был присвоен посредством @ru
label: P42 被分配类型 @zh
range: E17 Type Assignment
sub property of: P141 was assigned by
notation: P42i

P142 was used in
type: ObjectProperty
type: NamedIndividual
comment: Quantification of the inverse property: many to many (0,n:0,n) Scope note of the inverse property: This property associates an instance of E15 Identifier Assignment with the instance of E90 Symbolic Object used as constituent of an instance of E42 Identifier in this act of assignment. Examples of the inverse property: - Assigning the personal name identifier “Guillaume, de Machaut, ca. 1300-1377” on 1(st) June 2001 (E15) used constituent “ca. 1300-1377” (E41). (Kelly, 2014) - Assigning a uniform title to the anonymous textual work known as ‘The Adoration of the Shepherds’(E15) used constituent “Coventry” (E41). (Encyclopedia Britannica, 1998) - Assigning a uniform title to Pina Bausch’s choreographic work entitled ‘Rite of spring’ (E15) used constituent “(Choreographic Work: Bausch)” (E90). (Brandstetter and Klein, 2015) - Assigning a uniform title to the motion picture directed in 1933 by Merian C. Cooper and Ernest B. Schoedsack and entitled ‘King Kong’ (E15) used constituent “1933” (E61). (Goldner and Turner, 1976) - Assigning the corporate name identifier ‘Univerza v Ljubljani. Oddelek za bibliotekarstvo’ to The Department for library science of the University of Ljubljana in 2018 (E15) used constituent “Univerza v Ljubljani” (E42). [Done by the Department of Library and Information Science and Book Studies Library, University of Ljubljana in 2018] In First Order Logic of the inverse property: - P142(x,y) ⇒ E15(x) - P142(x,y) ⇒ E90(y) - P142(x,y) ⇒ P16(x,y)
domain: E90 Symbolic Object
label: P142 a été mobilisé dans @fr
label: P142 wurde benutzt in @de
label: P142 用于 @zh
range: E15 Identifier Assignment
sub property of: P16 was used for
notation: P142i

E78 Curated Holding
type: Class
type: NamedIndividual
comment: Scope note: This class comprises aggregations of instances of E18 Physical Thing that are assembled and maintained (“curated” and “preserved,” in museological terminology) by one or more instances of E39 Actor over time for a specific purpose and audience, and according to a particular collection development plan. Typical instances of curated holdings are museum collections, archives, library holdings and digital libraries. A digital library is regarded as an instance of E18 Physical Thing because it requires keeping physical carriers of the electronic content. Items may be added or removed from an E78 Curated Holding in pursuit of this plan. This class should not be confused with the E39 Actor maintaining the E78 Curated Holding who is often referred to using the name of the E78 Curated Holding (e.g. “The Wallace Collection decided…”). Collective objects in the general sense, like a tomb full of gifts, a folder with stamps, or a set of chessmen, should be documented as instances of E19 Physical Object, and not as instances of E78 Curated Holding. This is because they form wholes, either because they are physically bound together or because they are kept together for their functionality. Examples: - the John Clayton Herbarium (Blake, 1918), (Natural History Museum, 2021) - the Wallace Collection (Ingamells, 1990) - Mikael Heggelund Foslie’s coralline red algae Herbarium at the Museum of Natural History and Archaeology, Trondheim, Norway (Woelkerling et al., 2005) - the Digital Collections of the Munich DigitiZation Center (MDZ) accessible via https://www.digitale-sammlungen.de/ at least in January 2018. In First Order Logic: - E78(x) ⇒ E24(x)
label: E78 Collection @fr
subclass of: E24 Physical Human-Made Thing
subclass of: Restriction
  on property: P109 has current or former curator
  some values from: E39 Actor
notation: E78

P79 beginning is qualified by
type: DatatypeProperty
type: NamedIndividual
comment: Quantification: many to one (0,1:0,n) Scope note: This property associates an instance of E52 Time-Span with a note detailing the scholarly or scientific opinions and justifications about the certainty, precision, sources etc. of its beginning. Such notes may also be used to elaborate arguments about constraints or to give explanations of alternatives. Examples: - The time-span of the Holocene (E52) beginning is qualified by “The formal definition and dating of the GSSP (GlobalStratotype Section and Point) for the base of the Holocene using the Greenland NGRIP ice core, and selected auxiliary records” (E62). (Walker et al., 2009) In First Order Logic: - P79(x,y) ⇒ E52(x) - P79(x,y) ⇒ E62(y) - P79(x,y) ⇒ P3(x,y)
domain: E52 Time-Span
label: P79 a son début qualifié par @fr
label: P79 hat Anfangsbegründung @de
label: P79 início é qualificado por @pt
label: P79 αρχή προσδιορίζεται από @el
label: P79 начало ограничено @ru
label: P79 起始限定 @zh
sub property of: P3 has note
notation: P79

P123 resulted from
type: ObjectProperty
type: NamedIndividual
comment: Quantification of the inverse property: many to many, necessary (1,n:0,n) Scope note of the inverse property: This property identifies the instance or instances of E18 Physical Thing that are the result of an instance of E81 Transformation. New items replace the transformed item or items, which cease to exist as units of documentation. The physical continuity between the old and the new is expressed by the links to the common instance of E81 Transformation. Examples of the inverse property: - The transformation of the Venetian Loggia in Heraklion into a city hall (E81, E12) resulted in the City Hall of Heraklion (E24). [AND: has produced (P108) the City Hall of Heraklion (E22)] (Municipality of Heraklion, 2021) - The mummification of Tut-Ankh-Amun (E81, E12) resulted in the mummy of Tut-Ankh-Amun (E22,E20). [also: has produced (P108) the mummy of Tut-Ankh-Amun (E22, E20).] (Carter & Mace 1977) - The death, carbonization and petrification of some people of Pompeii in 79AD by the intense heat of a pyroclastic cloud and ashes from the eruption of Mount Vesuvius (E69, E81) resulted in petrified bodies (E20). [Some of these bodies could later be preserved in plaster.] In First Order Logic of the inverse property: - P123(x,y) ⇒ E81(x) - P123(x,y) ⇒ E18(y) - P123(x,y) ⇒ P92(x,y)
domain: E18 Physical Thing
label: P123 a résulté de @fr
label: P123 ergab sich aus @de
label: P123 resultado de @pt
label: P123 προέκυψε από @el
label: P123 был результатом @ru
label: P123 起因于 @zh
range: E81 Transformation
sub property of: P92 was brought into existence by
notation: P123i

E79 Part Addition
type: Class
type: NamedIndividual
comment: Scope note: This class comprises activities that result in an instance of E18 Physical Thing being increased, enlarged, or augmented by the addition of a part. Typical scenarios include the attachment of an accessory, the integration of a component, the addition of an element to an aggregate object, or the accessioning of an object into a curated instance of E78 Curated Holding. Both the E18 Physical Thing being augmented and the E18 Physical Thing that is being added are treated as separate identifiable wholes prior to the instance of E79 Part Addition. Following the addition of parts, the resulting assemblages are treated objectively as single identifiable wholes, made up of constituent or component parts bound together either physically (for example the engine becoming a part of the car), or by sharing a common purpose (such as the 32 chess pieces that make up a chess set). This class of activities forms a basis for reasoning about the history and continuity of identity of objects that are integrated into other objects over time, such as precious gemstones being repeatedly incorporated into different items of jewellery, or cultural artefacts being added to different museum instances of E78 Curated Holding over their lifespan. Examples: - the setting of the Koh-I-Noor diamond into the crown of Queen Elizabeth the Queen Mother (Dalrymple, 2017) - the addition of the painting “Room in Brooklyn” by Edward Hopper to the collection of the Museum of Fine Arts, Boston - the attachment of the bronze hand on the tree forming the Alpi Marittime [ https://giuseppepenone.com/en/words/maritime-alps] (Mangini, 2010) In First Order Logic: - E79(x) ⇒ E11(x)
label: E79 Adição de Parte @pt
label: E79 Ajout d'élément @fr
label: E79 Teilhinzufügung @de
label: E79 Προσθήκη Μερών @el
label: E79 Добавление Части @ru
label: E79 部分增加 @zh
subclass of: E11 Modification
subclass of: Restriction
  on property: P110 augmented
  some values from: E18 Physical Thing
subclass of: Restriction
  on property: P111 added
  some values from: E18 Physical Thing
notation: E79

P111 added
type: ObjectProperty
type: NamedIndividual
comment: Quantification: many to many, necessary (1,n:0,n) Scope note: This property identifies the instance of E18 Physical Thing that is added during an instance of E79 Part Addition activity. Examples: - The insertion of the final nail (E79) added the last nail in George VI’s coffin (E22). (https://www.rct.uk/collection/2000811/the-coffin-of-king-george-vi-during-the-lying-in-state) In First Order Logic: - P111(x,y) ⇒ E79(x) - P111(x,y) ⇒ E18(y) - P111(x,y) ⇒ P16(x,y)
domain: E79 Part Addition
label: P111 a ajouté @fr
label: P111 adicionou @pt
label: P111 fügte hinzu @de
label: P111 προσέθεσε @el
label: P111 добавил @ru
label: P111 增加了 @zh
range: E18 Physical Thing
sub property of: P16 used specific object
inverse of: P111 was added by
notation: P111

P8 took place on or within
type: ObjectProperty
type: NamedIndividual
comment: Quantification: many to many (0,n:0,n) Scope note: This property describes the location of an instance of E4 Period with respect to an instance of E18 Physical Thing. This property is a shortcut of the more fully developed path from E4 Period through P7 took place at, E53 Place, P156i is occupied by to E18 Physical Thing. It describes a period that can be located with respect to the space defined by an E19 Physical Object such as a ship or a building. The precise geographical location of the object during the period in question may be unknown or unimportant. For example, the French and German armistice of 22(nd) June 1940 was signed in the same railway carriage as the armistice of 11(th) November 1918. Examples: - The coronation of Queen Elizabeth II (E7) took place on or within Westminster Abbey (E18). (Strong, 2005) In First Order Logic: - P8(x,y) ⇒ E4(x) - P8(x,y) ⇒ E18(y) - P8(x,y) ⇐ (∃z) [E53(z) ˄ P7(x,z) ˄ P156i(z,y)]
domain: E4 Period
label: P8 a eu lieu à @fr
label: P8 fand statt auf oder innerhalb von @de
label: P8 ocorreu em ou dentro @pt
label: P8 έλαβε χώρα σε ή εντός @el
label: P8 имел место на или в @ru
label: P8 发生的所在对象是 @zh
range: E18 Physical Thing
inverse of: P8 witnessed
notation: P8

P151 was formed from
type: ObjectProperty
type: NamedIndividual
comment: Quantification: many to many (0,n:0,n) Scope note: This property associates an instance of E66 Formation with an instance of E74 Group from which the new group was formed preserving a sense of continuity such as in mission, membership or tradition. Examples: - The formation of the House of Bourbon-Conti in 1581 (E66) was formed from House of Condé (E74). (Collectif & Musée d'art et d'histoire Louis-Senlecq, 1900) In First Order Logic: - P151(x,y) ⇒ E66(x) - P151(x,y) ⇒ E74(y) - P151(x,y) ⇒ P11(x,y)
domain: E66 Formation
label: P151 a été formé à partir de @fr
range: E74 Group
sub property of: P11 had participant
inverse of: P151 participated in
notation: P151

P100 died in
type: ObjectProperty
type: NamedIndividual
comment: Quantification of the inverse property: one to many, necessary (1,n:0,1) Scope note of the inverse property: This property links an instance of E69 Death to the instance of E21 Person that died. An instance of E69 Death may involve multiple people, for example in the case of a battle or disaster. This is not intended for use with general natural history material, only people. Examples of the inverse property: - Mozart’s death (E69) was death of Mozart (E21). (Sitwell, 2017) In First Order Logic of the inverse property: - P100(x,y) ⇒ E69(x) - P100(x,y) ⇒ E21(y) - P100(x,y) ⇒ P93(x,y)
domain: E21 Person
label: P100 est mort par @fr
label: P100 morreu em @pt
label: P100 starb in @de
label: P100 πέθανε σε @el
label: P100 умер в @ru
label: P100 死于 @zh
range: E69 Death
sub property of: P93 was taken out of existence by
notation: P100i

E8 Acquisition
type: Class
type: NamedIndividual
comment: Scope note: This class comprises transfers of legal ownership from one or more instances of E39 Actor to one or more other instances of E39 Actor. The class also applies to the establishment or loss of ownership of instances of E18 Physical Thing. It does not, however, imply changes of any other kinds of rights. The recording of the donor and/or recipient is optional. It is possible that in an instance of E8 Acquisition there is either no donor or no recipient. Depending on the circumstances, it may describe: 1. the beginning of ownership 2. the end of ownership 3. the transfer of ownership 4. the acquisition from an unknown source 5. the loss of title due to destruction of the item It may also describe events where a collector appropriates legal title, for example, by annexation or field collection. The interpretation of the museum notion of “accession” differs between institutions. The CIDOC CRM therefore models legal ownership (E8 Acquisition) and physical custody (E10 Transfer of Custody) separately. Institutions will then model their specific notions of accession and deaccession as combinations of these. Examples: - the collection of a hammerhead shark, genus Sphyrna (Carchariniformes), by John Steinbeck and Edward Ricketts at Puerto Escondido in the Gulf of Mexico on 25(th) March 1940. (Steinbeck, 2000) - the acquisition of El Greco’s “The Apostles Peter and Paul” by the State Hermitage in Saint Petersburg. (https://hermitagemuseum.org/wps/portal/hermitage/digital-collection/01.+Paintings/32730) - the loss of my stuffed Fringilla coelebs due to insect damage last year (fictitious) In First Order Logic: - E8(x) ⇒ E7(x)
label: E8 Aquisição @pt
label: E8 Erwerb @de
label: E8 Απόκτηση @el
label: E8 Событие Приобретения @ru
label: E8 采访 @zh
subclass of: E7 Activity
subclass of: Restriction
  min cardinality: 1
  on property: P24 transferred title of
notation: E8

P177 assigned property of type
type: ObjectProperty
type: NamedIndividual
comment: Quantification: many to many, necessary (1,n:0,n) Scope note: This property associates an instance of E13 Attribute Assignment with the type of property or relation that this assignment maintains to hold between the item to which it assigns an attribute and the attribute itself. Note that the properties defined by the CIDOC CRM also constitute instances of E55 Type themselves. The direction of the assigned property of type is understood to be from the attributed item (the range of property P140 assigned attribute to) to the attribute item (the range of the property P141 assigned). More than one property type may be assigned to hold between two items. A comprehensive explanation about refining CIDOC CRM concepts by E55 Type is given in the section “About Types” in the section on “Specific Modelling Constructs” of this document. Examples: - The Current Ownership Assessment of Martin Doerr’s silver cup February 1997 (E13) assigned property of type P52 has former or current owner (is former or current keeper of) (E55). (fictitious) - 1(st) June 1997 Identifier Assignment of the silver cup donated by Martin Doerr (E15) assigned property of type P48 has preferred identifier (is preferred identifier of) (E55). (fictitious) - The examination of MS Sinai Greek 418 (E13) assigned property of type binding structure type (E55). [‘binding structure type’ refers to a property, external to the CIDOC CRM, which connects a book (E22) to the type of its binding structure (E55)] (Honey & Pickwoad, 2010) - The condition assessment of the endband cores of MS Sinai Greek 418 (E14) assigned property of type damage (E55). [‘damage’ refers to a property, external to the CIDOC CRM, which connects an instance of a physical thing like an endband core (E22) to the type of damage (E55) it shows] (Honey & Pickwoad, 2010) - The condition assessment of the cover of MS Sinai Greek 418 (E14) assigned property of type quality (E55). [‘quality’ refers to a property, external to the CIDOC CRM, which con…
domain: E13 Attribute Assignment
label: P177 a assigné le type de propriété @fr
range: E55 Type
sub property of: P2 has type
inverse of: P177 is type of property assigned
notation: P177

E71 Human-Made Thing
type: Class
type: NamedIndividual
comment: Scope note: This class comprises discrete, identifiable human-made items that are documented as single units. These items are either intellectual products or human-made physical things, and are characterized by relative stability. They may, for instance, have a solid physical form, an electronic encoding, or they may be logical concepts or structures. Examples: - Beethoven’s 5(th) Symphony (E73) (Lockwood, 2015) - Michelangelo’s David (E22) (Paoletti and Bagemihl, 2015) - Einstein’s Theory of General Relativity (E89) (Hartle, 2003) - the taxon ‘Fringilla coelebs Linnaeus,1758’ (E55) (Sinkevicius and Narusevicius, 2002) In First Order Logic: - E71(x) ⇒ E70(x)
label: E71 Chose élaborée par l’humain @fr
subclass of: E70 Thing
notation: E71

P106 forms part of
type: ObjectProperty
type: TransitiveProperty
type: NamedIndividual
comment: Quantification of the inverse property: many to many (0,n:0,n) Scope note of the inverse property: This property associates an instance of E90 Symbolic Object with a part of it that is by itself an instance of E90 Symbolic Object, such as fragments of texts or clippings from an image. This property is transitive asymmetric. Examples of the inverse property: - This Scope note of property P106 (E33) is composed of ‘fragments of texts’ (E33). - ‘recognizable’ (E90) is composed of ‘ecognizabl’ (E90). In First Order Logic of the inverse property: - P106(x,y) ⇒ E90(x) - P106(x,y) ⇒ E90(y) - [P106(x,y) ∧ P106(y,z)] ⇒ P106(x,z) - P106(x,y) ⇒ ¬P106(y,x)
domain: E90 Symbolic Object
label: P106 bildet Teil von @de
label: P106 fait partie de @fr
label: P106 faz parte de @pt
label: P106 αποτελεί μέρος του/της @el
label: P106 формирует часть @ru
label: P106 构成部分 @zh
range: E90 Symbolic Object
notation: P106i

P81 ongoing throughout
type: DatatypeProperty
type: NamedIndividual
comment: Quantification: many to many, necessary (1,n:0,n) Scope note: This property associates an instance of E52 Time-Span with an instance of E61 Time Primitive specifying a minimum period of time covered by it. Since Time-Spans may not have precisely known temporal extents, the CIDOC CRM supports statements about the minimum and maximum temporal extents of Time-Spans. This property allows a Time-Span’s minimum temporal extent (i.e., its inner boundary) to be assigned an E61 Time Primitive value. Time Primitives are treated by the CIDOC CRM as application or system specific date intervals, and are not further analysed. If different sources of evidence justify different minimum extents without contradicting each other, the smallest interval including all these extents will be the best estimate. This should be taken into account for information integration. Examples: - The time-span of the development of the CIDOC CRM (E52) ongoing throughout “1996-2003” (E61). (Doerr, 2003) - The Time-Span of the Thirty Years War (E52) ongoing throughout “23(rd) May 1618 AD until 24(th) October 1648 AD” (E61). (Bonney, 2014) - The time-span of the First Intermediate Period of Ancient Egypt (7(th) to 10(th) dynasty) (E52) ongoing throughout “2181 BC – 2160 BC” (E61). (Reid, 1993) [This is the minimal common agreement of two conflicting dates: James Henry Breasted dates the First Intermediate Period of Ancient Egypt (7(th) to 10(th) dynasty) from 2475BC to 2160BC in his Ancient Records (first published in 1906), volume 1, sections 58–75 (Breasted, 1906). Ian Shaw dates it from 2181BC to 2125BC in his Oxford History of Ancient Egypt (published in 2000), pp. 479–483 (Shaw, 2000).] In First Order Logic: - P81(x,y) ⇒ E52(x) - P81(x,y) ⇒ E61(y)
domain: E52 Time-Span
label: P81 a couvert @fr
label: P81 abrange no mínimo @pt
label: P81 andauernd während @de
label: P81 καθόλη τη διάρκεια του/της @el
label: P81 длится в течение @ru
label: P81 最短范围是 @zh
notation: P81

E65 Creation
type: Class
type: NamedIndividual
comment: Scope note: This class comprises events that result in the creation of conceptual items or immaterial products, such as legends, poems, texts, music, images, movies, laws, types, etc. Examples: - the framing of the U.S. Constitution (Farrand, 1913) - the drafting of U.N. Resolution 1441 (United Nations Security Council, 2002) In First Order Logic: - E65(x) ⇒ E7(x) - E65(x) ⇒ E63(x)
label: E65 Begriffliche Schöpfung @de
label: E65 Criação @pt
label: E65 Création @fr
label: E65 Δημιουργία @el
label: E65 Событие Творения @ru
label: E65 创建 @zh
subclass of: E63 Beginning of Existence
subclass of: E7 Activity
subclass of: Restriction
  on property: P94 has created
  some values from: E28 Conceptual Object
notation: E65

E86 Leaving
type: Class
type: NamedIndividual
comment: Scope note: This class comprises the activities that result in an instance of E39 Actor to be disassociated from an instance of E74 Group. This class does not imply initiative by either party. It may be the initiative of a third party. Typical scenarios include the termination of membership in a social organisation, ending the employment at a company, divorce, and the end of tenure of somebody in an official position. Examples: - the end of Sir Isaac Newton’s duty as Member of Parliament for the University of Cambridge to the Convention Parliament in 1702 (Gleick, 2003) - George Washington’s leaving office in 1797 (Jones, 1979) - the implementation of the treaty regulating the termination of Greenland’s membership in EU between EU, Denmark and Greenland 1(st) February 1985 In First Order Logic: - E86(x) ⇒ E7(x)
label: E86 Austritt @de
label: E86 Départ @fr
label: E86 离开 @zh
subclass of: E7 Activity
subclass of: Restriction
  min cardinality: 1
  on property: P146 separated from
subclass of: Restriction
  cardinality: 1
  on property: P145 separated
notation: E86

E81 Transformation
type: Class
type: NamedIndividual
comment: Scope note: This class comprises the events that result in the simultaneous destruction of one or more than one E18 Physical Thing and the creation of one or more than one E18 Physical Thing that preserves recognizable substance and structure from the first one(s) but has fundamentally different nature or identity. Although the old and the new instances of E18 Physical Thing are treated as discrete entities having separate, unique identities, they are causally connected through the E81 Transformation; the destruction of the old E18 Physical Thing(s) directly causes the creation of the new one(s) using or preserving some relevant substance and structure. Instances of E81 Transformation are therefore distinct from re-classifications (documented using E17 Type Assignment) or modifications (documented using E11 Modification) of objects that do not fundamentally change their nature or identity. Characteristic cases are reconstructions and repurposing of historical buildings or ruins, fires leaving buildings in ruins, taxidermy of specimen in natural history. Even though such instances of E81 Transformation are often motivated by a change of intended use, substantial material changes should justify the documentation of the result as a new instance of E18 Physical Thing and not just the change of function. The latter may be documented as an extended activity (instance of E7 Activity) of using it. Examples: - the mummification of Tut-Ankh-Amun (E81, E12) [the mummification of the body of the deceased is a human production process and simultaneously preserves structures of the body at and before death] (Carter and Mace 1977) - the death, carbonization and petrification of some people of Pompeii in 79AD by the intense heat of a pyroclastic cloud and ashes from the Eruption of Mount Vesuvius (E69, E81) - the transformation of the Hephaisteion temple in Athens, better known as “Theseion”, into a Christian church, dedicated to Saint George <https://en.wikipedia.org/wiki/Saint_Ge…
label: E81 Transformação @pt
label: E81 Umwandlung @de
label: E81 Μετατροπή @el
label: E81 Трансформация @ru
label: E81 转变 @zh
subclass of: E63 Beginning of Existence
subclass of: E64 End of Existence
subclass of: Restriction
  on property: P123 resulted in
  some values from: E18 Physical Thing
subclass of: Restriction
  on property: P124 transformed
  some values from: E18 Physical Thing
notation: E81

P24 transferred title of
type: ObjectProperty
type: NamedIndividual
comment: Quantification: many to many, necessary (1,n:0,n) Scope note: This property identifies the instance(s) of E18 Physical Thing involved in an instance of E8 Acquisition. In reality, an acquisition must refer to at least one transferred item. Examples: - The acquisition of the Amoudruz collection by the Geneva Ethnography Museum (E8) transferred title of the Amoudruz Collection (E78). In First Order Logic: - P24(x,y) ⇒ E8(x) - P24(x,y) ⇒ E18(y)
domain: E8 Acquisition
label: P24 a transféré le titre de propriété de @fr
label: P24 transferiu os direitos de propriedade sobre o @pt
label: P24 übertrug Besitz über @de
label: P24 μετεβίβασε τον τίτλο του/της @el
label: P24 передал право собственности на @ru
label: P24 转移所有权的是 @zh
range: E18 Physical Thing
inverse of: P24 changed ownership through
notation: P24

E66 Formation
type: Class
type: NamedIndividual
comment: Scope note: This class comprises events that result in the formation of a formal or informal E74 Group of people, such as a club, society, association, corporation, or nation. E66 Formation does not include the arbitrary aggregation of people who do not act as a collective. The formation of an instance of E74 Group does not require that the group is populated with members at the time of formation. In order to express the joining of members at the time of formation, the respective activity should be simultaneously an instance of both E66 Formation and E85 Joining. Examples: - the formation of the CIDOC CRM Special Interest Group in 2000 - the formation of the Soviet Union (Pipes, 1964) - the conspiring of the murderers of Caesar (Irwin, 1935) In First Order Logic: - E66(x) ⇒ E7(x) - E66(x) ⇒ E63(x)
label: E66 Formação @pt
label: E66 Gruppenbildung @de
label: E66 Συγκρότηση Ομάδας @el
label: E66 Событие Формирования @ru
label: E66 组成 @zh
subclass of: E63 Beginning of Existence
subclass of: E7 Activity
subclass of: Restriction
  on property: P95 has formed
  some values from: E74 Group
notation: E66

P45 consists of
type: ObjectProperty
type: NamedIndividual
comment: Quantification: many to many, necessary (1,n:0,n) Scope note: This property identifies the instances of E57 Materials of which an instance of E18 Physical Thing is composed. All physical things consist of physical materials. P45 consists of (is incorporated in) allows the different materials to be recorded. P45 consists of (is incorporated in) refers here to observed material as opposed to the consumed raw material. A material, such as a theoretical alloy, may not have any physical instances. Examples: - Silver cup 232 (E22) consists of silver (E57). (fictitious) In First Order Logic: - P45(x,y) ⇒ E18(x) - P45(x,y) ⇒ E57(y)
domain: E18 Physical Thing
label: P45 besteht aus @de
label: P45 comprend @fr
label: P45 consiste de @pt
label: P45 αποτελείται από @el
label: P45 составлен из @ru
label: P45 包含 @zh
range: E57 Material
inverse of: P45 is incorporated in
notation: P45

P22 transferred title to
type: ObjectProperty
type: FunctionalProperty
type: NamedIndividual
comment: Quantification: many to many (0,n:0,n) Scope note: This property identifies the instance of E39 Actor that acquires the legal ownership of an object as a result of an instance of E8 Acquisition. The property will typically describe an Actor purchasing or otherwise acquiring an object from another Actor. However, title may also be acquired without any corresponding loss of title by another Actor, through legal fieldwork such as hunting, shooting, or fishing. In reality, the title is either transferred to or from someone, or both. Examples: - The acquisition of the Amoudruz collection by the Geneva Ethnography Museum (E8) transferred title to the Geneva Ethnography Museum (E74). In First Order Logic: - P22(x,y) ⇒ E8(x) - P22(x,y) ⇒ E39(y) - P22(x,y) ⇒ P14(x,y)
domain: E8 Acquisition
label: P22 a transféré le titre de propriété à @fr
label: P22 transferiu os direitos de propriedade para @pt
label: P22 übertrug Besitztitel auf @de
label: P22 μετεβίβασε τον τίτλο σε @el
label: P22 передал право собственности @ru
label: P22 转移所有权至 @zh
range: E39 Actor
sub property of: P14 carried out by
inverse of: P22 acquired title through
notation: P22

P31 has modified
type: ObjectProperty
type: NamedIndividual
comment: Quantification: many to many, necessary (1,n:0,n) Scope note: This property identifies the instance of E18 Physical Thing modified in an instance of E11 Modification. Examples: - The rebuilding of the German Reichstag in Berlin (E11) has modified the Reichstag in Berlin (E24). (Foster, 2000) In First Order Logic: - P31(x,y) ⇒ E11(x) - P31(x,y) ⇒ E18(y) - P31(x,y) ⇒ P12(x,y)
domain: E11 Modification
label: P31 a modifié @fr
label: P31 modificou @pt
label: P31 veränderte @de
label: P31 τροποποίησε @el
label: P31 изменил @ru
label: P31 已更改 @zh
range: E18 Physical Thing
sub property of: P12 occurred in the presence of
inverse of: P31 was modified by
notation: P31

P14 carried out by
type: ObjectProperty
type: NamedIndividual
comment: Quantification: many to many, necessary (1,n:0,n) Scope note: This property describes the active participation of an instance of E39 Actor in an instance of E7 Activity. It implies causal or legal responsibility. The P14.1 in the role of property of the property specifies the nature of an Actor’s participation. Examples: - The painting of the Sistine Chapel (E7) carried out by Michelangelo Buonaroti (E21) in the role of master craftsman (E55). (Goldscheider, 1953) Properties: - P14.1 in the role of: E55 Type In First Order Logic: - P14(x,y) ⇒ E7(x) - P14(x,y)⇒ E39(y) - P14(x,y) ⇒ P11(x,y) - P14(x,y,z) ⇒ [P14(x,y) ∧ E55(z)]
domain: E7 Activity
label: P14 a été effectué par @fr
label: P14 realizada por @pt
label: P14 wurde ausgeführt von @de
label: P14 πραγματοποιήθηκε από @el
label: P14 выполнялся @ru
label: P14 执行者是 @zh
range: E39 Actor
sub property of: P11 had participant
inverse of: P14 performed
notation: P14

P15 influenced
type: ObjectProperty
type: NamedIndividual
comment: Quantification of the inverse property: many to many (0,n:0,n) Scope note of the inverse property: This is a high-level property, which captures the relationship between an instance of E7 Activity and anything, that is, an instance of E1 CRM Entity, that may have had some bearing upon it. The property has more specific subproperties. Examples of the inverse property: - The designing of the Sydney Harbour Bridge (E7) was influenced by the Tyne Bridge (E22). (Dorman Long, 1932) In First Order Logic of the inverse property: - P15(x,y) ⇒ E7(x) - P15(x,y) ⇒ E1(y)
domain: E1 CRM Entity
label: P15 a influencé @fr
label: P15 beeinflußte @de
label: P15 influenciou @pt
label: P15 επηρέασε @el
label: P15 оказал влияние на @ru
label: P15 影响 @zh
range: E7 Activity
notation: P15i

P165 is incorporated in
type: ObjectProperty
type: NamedIndividual
comment: Quantification of the inverse property: many to many (0,n:0,n) Scope note of the inverse property: This property associates an instance of E73 Information Object with an instance of E90 Symbolic Object (or any of its subclasses) that was included in it. This property makes it possible to recognise the autonomous status of the incorporated signs, which were created in a distinct context, and can be incorporated in many instances of E73 Information Object, and to highlight the difference between structural and accidental whole-part relationships between conceptual entities. It accounts for many cultural facts that are quite frequent and significant: the inclusion of a poem in an anthology, the re-use of an operatic aria in a new opera, the use of a reproduction of a painting for a book cover or a CD booklet, the integration of textual quotations, the presence of lyrics in a song that sets those lyrics to music, the presence of the text of a play in a movie based on that play, etc. In particular, this property allows for modelling relationships of different levels of symbolic specificity, such as the natural language words making up a particular text, the characters making up the words and punctuation, the choice of fonts and page layout for the characters. When restricted to information objects, that is, seen as a property with E73 Information Object as domain and range the property is transitive. A digital photograph of a manuscript page incorporates the text of a manuscript page, if the respective text is defined as a sequence of symbols of a particular type, such as Latin characters, and the resolution and quality of the digital image is sufficient to resolve these symbols so they are readable on the digital image. This property is asymmetric. Examples of the inverse property: - The content of Charles-Moïse Briquet’s ‘Les Filigranes: dictionnaire historique des marques du papier’ (E32) incorporates the visual aspect of the watermark used around 1358-61 by some Span…
domain: E90 Symbolic Object
label: P165 est inclus dans @fr
range: E73 Information Object
sub property of: P106 forms part of
notation: P165i

P191 had duration
type: ObjectProperty
type: NamedIndividual
comment: Quantification: one to one (1,1:1,1) Scope note: This property describes the length of time covered by an instance of E52 Time-Span. It allows an instance of E52 Time-Span to be associated with an instance of E54 Dimension representing duration independent from the actual beginning and end. Indeterminacy of the duration value can be expressed by assigning a numerical interval to the property P90 has value of E54 Dimension. Examples: - The time-span of the Battle of Issos 333 B.C.E. (E52) had duration Battle of Issos duration (E54). (Howard, 2012) In First Order Logic: - P191(x,y) ⇒ E52(x) - P191(x,y) ⇒ E54(y)
domain: E52 Time-Span
label: P191 a eu pour durée @fr
range: E54 Dimension
inverse of: P191 was duration of
notation: P191

P137 exemplifies
type: ObjectProperty
type: NamedIndividual
comment: Quantification: many to many (0,n:0,n) Scope note: This property associates an instance of E1 CRM Entity with an instance of E55 Type for which it has been declared to be a particularly characteristic example. The P137.1 in the taxonomic role property of P137 exemplifies (is exemplified by) allows differentiation of taxonomic roles. The taxonomic role renders the specific relationship of this example to the type, such as “prototypical”, “archetypical”, “lectotype”, etc. The taxonomic role “lectotype” is not associated with the instance of E83 Type Creation itself but is selected in a later phase. Examples: - Object BM000098044 of the Clayton Herbarium (E20) exemplifies ‘Spigelia marilandica’ (L.) L. (E55) in the taxonomic role lectotype (E55). (Natural History Museum, 2021) Properties: - P137.1 in the taxonomic role: E55 Type In First Order Logic: - P137(x,y) ⇒ E1(x) - P137(x,y) ⇒ E55(y) - P137(x,y,z) ⇒ [P137(x,y) ∧ E55(z)] - P137(x,y) ⇒ P2(x,y)
domain: E1 CRM Entity
label: P137 erläutert @de
label: P137 exemplifie @fr
label: P137 é exemplificado por @pt
label: P137 δειγματίζει @el
label: P137 поясняет @ru
label: P137 例示 @zh
range: E55 Type
sub property of: P2 has type
inverse of: P137 is exemplified by
notation: P137

P27 was origin of
type: ObjectProperty
type: NamedIndividual
comment: Quantification of the inverse property: many to many, necessary (1,n:0,n) Scope note of the inverse property: This property identifies an origin, an instance of E53 Place, of an instance of E9 Move. A move will be linked to an origin, such as the move of an artifact from storage to display. A move may be linked to many starting instances of E53 Place by multiple instances of this property. In this case the move describes the picking up of a set of objects. The area of the move includes the origin(s), route and destination(s). Therefore, the described origin is an instance of E53 Place which P89 falls within (contains) the instance of E53 Place the move P7 took place at. Examples of the inverse property: - The movement of the exhibition “Tutankhamun: Treasures of the Golden Pharaoh” between 15(th) September and 2(nd) November 2019 (E9) moved from Paris, Grande Halle de la Villette (E53). In First Order Logic of the inverse property: - P27(x,y) ⇒ E9(x) - P27(x,y) ⇒ E53(y) - P27(x,y) ⇒ (∃z) [E53(z) ∧ P7(x,z) ∧ P89(y,z)]
domain: E53 Place
label: P27 a été le point de départ de @fr
label: P27 era origem de @pt
label: P27 war Ausgangsort von @de
label: P27 ήταν αφετηρία του/της @el
label: P27 был исходной точкой для @ru
label: P27 是起点 @zh
range: E9 Move
notation: P27i

P62 depicts
type: ObjectProperty
type: NamedIndividual
comment: Quantification: many to many (0,n:0,n) Scope note: This property identifies something that is depicted by an instance of E24 Physical Human-Made Thing. Depicting is meant in the sense that an instance of E24 Physical Human-Made Thing intentionally shows, through its optical qualities or form, a representation of the entity depicted. Photographs are by default regarded as being intentional in this sense. Anything that is designed to change the properties of the depiction, such as an e-book reader, is specifically excluded. The property does not pertain to inscriptions or any other information encoding. This property is a shortcut of the more fully developed path from E24 Physical Human-Made Thing through P65 shows visual item, E36 Visual Item, P138 represents to E1 CRM Entity. P62.1 mode of depiction allows the nature of the depiction to be refined. Examples: - The painting “La Liberté guidant le peuple” by Eugène Delacroix (E22) depicts the French “July Revolution” of 1830 (E7). (Delacroix, 1982) - The 20 pence coin held by the Department of Coins and Medals of the British Museum under registration number 2006,1101.126 (E22) depicts Queen Elizabeth II (E21) mode of depiction Profile (E55). Properties: - P62.1 mode of depiction: E55 Type In First Order Logic: - P62(x,y) ⇒ E24(x) - P62(x,y) ⇒ E1(y) - P62(x,y,z) ⇒ [P62(x,y) ∧ E55(z)] - P62(x,y) ⇐ (∃z) [E36(z) ˄ P65(x,z) ˄ P138(z,y)]
domain: E24 Physical Human-Made Thing
label: P62 bildet ab @de
label: P62 illustre @fr
label: P62 retrata @pt
label: P62 απεικονίζει @el
label: P62 описывает @ru
label: P62 描绘了 @zh
range: E1 CRM Entity
inverse of: P62 is depicted by
notation: P62

P166 was a presence of
type: ObjectProperty
type: NamedIndividual
comment: Quantification: many to one, necessary (1,1:0,n) Scope note: This property associates an instance of E93 Presence with the instance of E92 Spacetime Volume of which it represents a temporal restriction (i.e. a time-slice). Instantiating this property constitutes a necessary part of the identity of the respective instance of E93 Presence. Examples: - The Roman Empire on 19(th) August AD 14 (E93) was a presence of The Roman Empire (E4). (Clare and Edwards, 1992) In First Order Logic: - P166(x,y) ⇒ E93(x) - P166(x,y) ⇒ E92(y) - P166(x,y) ⇒ P10(x,y)
domain: E93 Presence
label: P166 a été une présence de @fr
range: E92 Spacetime Volume
sub property of: P10 falls within
inverse of: P166 had presence
notation: P166

P167 includes
type: ObjectProperty
type: NamedIndividual
comment: Quantification of the inverse property: many to many, necessary (1,n:0,n) Scope note of the inverse property: This property associates an instance of E93 Presence with an instance of E53 Place that geometrically includes the spatial projection of the respective instance of E93 Presence. Besides others, this property may be used to state in which space an object has been for some known time, such as a room of a castle or in a drawer. It may also be used to describe a confinement of the spatial extent of some realm during a known time-span. This property is a shortcut of the more fully developed path from E93 Presence through P161 has spatial projection, E53 Place, P89 falls within (contains) to E53 Place. Examples of the inverse property: - Johann Joachim Winckelmann’s whereabouts in December 1755 (E93) was within Rome (E53). (Leppmann, 1970) - Johann Joachim Winckelmann’s whereabouts from 19(th) November 1755 until 9(th) April 1768 (E93) was within Italy (E53). (Leppmann, 1970) In First Order Logic of the inverse property: - P167(x,y) ⇒ E93(x) - P167(x,y) ⇒ E53(y) - P167(x,y) ⇔ (∃z) [E53(z) ˄ P161(x,z) ˄ P89(z,y)]
domain: E53 Place
label: P167 comporte @fr
range: E93 Presence
notation: P167i

P109 is current or former curator of
type: ObjectProperty
type: NamedIndividual
comment: Quantification of the inverse property: many to many, necessary (1,n:0,n) Scope note of the inverse property: This property identifies the instance of E39 Actor who assumed or has assumed overall curatorial responsibility for an instance of E78 Curated Holding. It does not allow a history of curation to be recorded. This would require use of an event initiating a curator being responsible for a collection. Examples of the inverse property: - The Robert Opie Collection (E78) has current or former curator Robert Opie (E21). (https://www.robertopiecollection.com/) - The Mikael Heggelund Foslie’s coralline red algae Herbarium (E78) has current or former curator Mikael Heggelund Foslie (E21). (Woelkerling et al., 2005) In First Order Logic of the inverse property: - P109(x,y) ⇒ E78(x) - P109(x,y) ⇒ E39(y) - P109(x,y) ⇒ P49(x,y)
domain: E39 Actor
label: P109 est responsable actuel ou antérieur de la collection @fr
label: P109 ist derzeitiger oder früherer Kurator von @de
label: P109 é ou foi curador de @pt
label: P109 είναι ή ήταν επιμελητής του/της @el
label: P109 является действующим или бывшим хранителем @ru
label: P109 是当前或以往管理者 @zh
range: E78 Curated Holding
sub property of: P49 is former or current keeper of
notation: P109i

P92 brought into existence
type: ObjectProperty
type: NamedIndividual
comment: Quantification: one to many, necessary, dependent (1,n:1,1) Scope note: This property links an instance of E63 Beginning of Existence to the instance of E77 Persistent Item brought into existence by it. It allows a “start” to be attached to any instance of E77 Persistent Item being documented, i.e., as instances of E70 Thing, E72 Legal Object, E39 Actor, E41 Appellation and E55 Type. Examples: - The birth of Mozart (E67) brought into existence Mozart (E21). (Deutsch, 1965) In First Order Logic: - P92(x,y) ⇒ E63(x) - P92(x,y) ⇒ E77(y) - P92(x,y) ⇒ P12(x,y)
domain: E63 Beginning of Existence
label: P92 a fait exister @fr
label: P92 brachte in Existenz @de
label: P92 trouxe à existência @pt
label: P92 γέννησε @el
label: P92 создал @ru
label: P92 导致存在的是 @zh
range: E77 Persistent Item
sub property of: P12 occurred in the presence of
inverse of: P92 was brought into existence by
notation: P92

P126 employed
type: ObjectProperty
type: NamedIndividual
comment: Quantification: many to many (0,n:0,n) Scope note: This property identifies the instance of E57 Material employed in an instance of E11 Modification. The instance of E57 Material used during the instance of E11 Modification does not necessarily become incorporated into the instance of E24 Physical Human-Made Thing that forms the subject of the instance of E11 Modification. Examples: - The repairing of the Queen Mary (E11) employed Steel (E57). [Beginning October 1942] (Britton, 2012) - Distilled water (E57) was employed in the restoration of the Sistine Chapel (E11). (Pietrangeli, 1986) In First Order Logic: - P126(x,y) ⇒ E11(x) - P126(x,y) ⇒ E57(y)
domain: E11 Modification
label: P126 a employé @fr
label: P126 empregou @pt
label: P126 verwendete @de
label: P126 χρησιμοποίησε @el
label: P126 использовал @ru
label: P126 使用 @zh
range: E57 Material
inverse of: P126 was employed in
notation: P126

P196 defines
type: ObjectProperty
type: NamedIndividual
comment: Quantification: one to one, necessary (1,1:0,1) Scope note: This property associates an instance of E18 Physical Thing with the instance of E92 Spacetime Volume that constitutes the complete trajectory of its geometric extent through spacetime for the whole time of the existence of the instance of E18 Physical Thing. An instance of E18 Physical Thing not only occupies a particular geometric space at each instant of its existence, but in the course of its existence it also forms a trajectory through spacetime, which occupies a real, that is phenomenal, volume in spacetime, i.e. the instance of E92 Spacetime Volume this property associates it with. This real spatiotemporal extent of the instance of E18 Physical Thing is regarded as being unique, in all its details and fuzziness; the identity and existence of the instance of E92 Spacetime Volume depend uniquely on the identity of the instance of E18 Physical Thing, whose existence defines it. It constitutes a phenomenal spacetime volume as defined in CRMgeo (Doerr & Hiebel, 2013). Included in this spacetime volume are both the spaces filled by the matter of the physical thing and any inner space that may exist, for instance the interior of a box. Physical things consisting of aggregations of physically unconnected objects, such as a set of chessmen, occupy a finite number of individually contiguous subsets of this spacetime volume equal to the number of objects that constitute the set and that are never connected during its existence. Examples: - H.M.S. Temeraire (E22) defines the spacetime volume of H.M.S. Temeraire (E92). [it was built, during 1798, in Chatham and destroyed, during 1838, in Rotherhithe] (Willis, 2010) - The Saint Titus reliquary (E22) defines the spacetime volume of the Saint Titus reliquary (E92). [the reliquary has been produced by the workshop of the Vogiatzis brothers located at Monastiraki, Athens, in 1966 as container for the skull of Saint Titus, which was placed into it at that time and has s…
domain: E18 Physical Thing
label: P196 définit @fr
range: E92 Spacetime Volume
inverse of: P196 is defined by
notation: P196

P139 has alternative form
type: ObjectProperty
type: NamedIndividual
comment: Quantification: many to many (0,n:0,n) Scope note: This property associates an instance of E41 Appellation with another instance of E41 Appellation that constitutes a derivative or variant of the former and that may also be used for identifying items identified by the former, in suitable contexts, independent from the particular item to be identified. This property should not be confused with additional variants of names used characteristically for a single, particular item, such as individual nicknames. It is a directed relationship, where the range expresses the derivative or variant and the domain the source of derivation or original form of variation, if such a direction can be established. Otherwise, the relationship is symmetric. Multiple names assigned to an object, which do not apply to all things identified with the specific instance of E41 Appellation, should be modelled as repeated values of P1 is identified by (identifies) of this object. P139.1 has type allows the type of derivation to be refined, for instance “transliteration from Latin 1 to ASCII”. Examples: - “Martin Doerr” (E41) has alternative form “Martin Dörr” (E41) has type alternate spelling (E55). - “Гончарова, Наталья Сергеевна” (E41) has alternative form "Gončarova, Natal´â Sergeevna" (E41) has type ISO 9:1995 transliteration (E55). - “Αθήνα” (E41) has alternative form “Athina” (E41) has type transcription (E55). Properties: - P139.1 has type: E55 Type In First Order Logic: - P139(x,y) ⇒ E41(x) - P139(x,y) ⇒ E41(y) - P139(x,y,z) ⇒ [P139(x,y) ∧ E55(z)] - ¬P139(x,x)
domain: E41 Appellation
label: P139 a pour forme alternative @fr
label: P139 hat alternative Form @de
label: P139 tem forma alternativa @pt
label: P139 έχει εναλλακτική μορφή @el
label: P139 имеет альтернативную форму @ru
label: P139 有交替形式 @zh
range: E41 Appellation
inverse of: P139 is alternative form of
notation: P139

P174 starts before the end of
type: ObjectProperty
type: NamedIndividual
comment: Quantification: many to many (0,n:0,n) Scope note: This property specifies that the temporal extent of the domain instance A of E2 Temporal Entity starts definitely before the end of the temporal extent of the range instance B of E2 Temporal Entity. In other words, if A = [A(start), A(end)] and B = [B(start), B(end)], it means A(start) < B(end) is true. This property is part of the set of temporal primitives P173 – P176, P182 – P185. This property corresponds to a disjunction (logical OR) of the following Allen temporal relations (Allen, 1983): {before, meets, overlaps, starts, started-by, contains, finishes, finished-by, equals, during, overlapped by} Typically, this property is a consequence of a known influence of some event on another event or activity, such as a novel written by someone being continued by someone else, or the knowledge of a defeat on a distant battlefield causing people to end their ongoing activities. This property is not transitive. This property is irreflexive. https://cidoc-crm.org/html/version_images/images_7.1.3/image_03.png Figure 10: Temporal entity A starts before the end of temporal entity B. Here A is longer than B https://cidoc-crm.org/html/version_images/images_7.1.3/image_04.png Figure 11: Temporal entity A starts before the end of temporal entity B. Here A is shorter than B Examples: - The settling activity of the city of Assur (Ashur) (E7) starts before the end of The Tenth Dynasty of Egypt (E4). [There are some 200 - 300 years differences in the chronology of the First Intermediate Period, and Assur is dated to “about 2500 BC”.] (Pedersén, 1986) - The building of the current St. Peters in Rome (E7) starts before the end of the demolition of the old 4(th) c. St. Peters (E6, E7) (Bosman, 2004) In First Order Logic: - P174(x,y) ⇒ E2(x) - P174(x,y) ⇒ E2(y) - P174(x,y) ⇒ P173(x,y) - ¬P174(x,x)
domain: E2 Temporal Entity
label: P174 commence avant la fin de @fr
range: E2 Temporal Entity
sub property of: P173 starts before or with the end of
inverse of: P174 ends after the start of
notation: P174

P97 from father
type: ObjectProperty
type: NamedIndividual
comment: Quantification: many to one, necessary (1,1:0,n) Scope note: This property links an instance of E67 Birth to an instance of E21 Person in the role of biological father. Note that biological fathers are not seen as necessary participants in the birth, whereas birth-giving mothers are (see P96 by mother (gave birth)). The Person being born is linked to the Birth with the property P98 brought into life (was born). This is not intended for use with general natural history material, only people. There is no explicit method for modelling conception and gestation except by using extensions. An instance of E67 Birth is normally (but not always) associated with one biological father. Examples: - King George VI (E21) was father for the birth of Queen Elizabeth II (E67). (Parker, 2002) In First Order Logic: - P97(x,y) ⇒ E67(x) - P97(x,y) ⇒ E21(y)
domain: E67 Birth
label: P97 de père @fr
label: P97 gab Vaterschaft @de
label: P97 pelo pai @pt
label: P97 είχε πατέρα @el
label: P97 от отца @ru
label: P97 来自父亲 @zh
range: E21 Person
inverse of: P97 was father for
notation: P97

P81a end of the begin
type: DatatypeProperty
type: NamedIndividual
domain: E52 Time-Span
label: P81a Ende des Anfangs @de
label: P81a fim do início @pt
label: P81a fin du début @fr
label: P81a τέλος της αρχής @el
label: P81a конец начала @ru
sub property of: P81 ongoing throughout
notation: P81a

P129 is about
type: ObjectProperty
type: NamedIndividual
comment: Quantification: many to many (0,n:0,n) Scope note: This property documents that an instance of E89 Propositional Object has as subject an instance of E1 CRM Entity. This differs from P67 refers to (is referred to by), which refers to an instance of E1 CRM Entity, in that it describes the primary subject or subjects of an instance of E89 Propositional Object. Examples: - The text entitled ‘Reach for the sky’ (E33) is about Douglas Bader (E21). (Brickhill, 2001) In First Order Logic: - P129(x,y) ⇒ E89(x) - P129(x,y) ⇒ E1(y) - P129(x,y) ⇒ P67(x,y)
domain: E89 Propositional Object
label: P129 a pour sujet @fr
label: P129 handelt über @de
label: P129 é sobre @pt
label: P129 έχει ως θέμα @el
label: P129 касается @ru
label: P129 有关 @zh
range: E1 CRM Entity
sub property of: P67 refers to
inverse of: P129 is subject of
notation: P129

P15 was influenced by
type: ObjectProperty
type: NamedIndividual
comment: Quantification: many to many (0,n:0,n) Scope note: This is a high-level property, which captures the relationship between an instance of E7 Activity and anything, that is, an instance of E1 CRM Entity, that may have had some bearing upon it. The property has more specific subproperties. Examples: - The designing of the Sydney Harbour Bridge (E7) was influenced by the Tyne Bridge (E22). (Dorman Long, 1932) In First Order Logic: - P15(x,y) ⇒ E7(x) - P15(x,y) ⇒ E1(y)
domain: E7 Activity
label: P15 a été influencé par @fr
label: P15 foi influenciado por @pt
label: P15 wurde beeinflußt durch @de
label: P15 επηρεάστηκε από @el
label: P15 находился под влиянием @ru
label: P15 被影响 @zh
range: E1 CRM Entity
inverse of: P15 influenced
notation: P15

P24 changed ownership through
type: ObjectProperty
type: NamedIndividual
comment: Quantification of the inverse property: many to many, necessary (1,n:0,n) Scope note of the inverse property: This property identifies the instance(s) of E18 Physical Thing involved in an instance of E8 Acquisition. In reality, an acquisition must refer to at least one transferred item. Examples of the inverse property: - The acquisition of the Amoudruz collection by the Geneva Ethnography Museum (E8) transferred title of the Amoudruz Collection (E78). In First Order Logic of the inverse property: - P24(x,y) ⇒ E8(x) - P24(x,y) ⇒ E18(y)
domain: E18 Physical Thing
label: P24 a changé de propriétaire par @fr
label: P24 ging über in Besitz durch @de
label: P24 mudou de proprietário por meio de @pt
label: P24 άλλαξε ιδιοκτησία μέσω @el
label: P24 сменил владельца через @ru
label: P24 变更所有权 @zh
range: E8 Acquisition
notation: P24i

P176 starts after the start of
type: ObjectProperty
type: TransitiveProperty
type: NamedIndividual
comment: Quantification of the inverse property: many to many (0,n:0,n) Scope note of the inverse property: This property specifies that the temporal extent of the domain instance A of E2 Temporal Entity starts definitely before the start of the temporal extent of the range instance B of E2 Temporal Entity. In other words, if A = [A(start), A(end)] and B = [B(start), B(end)], it means A(start) < B(start) is true. This property is part of the set of temporal primitives P173 – P176, P182 – P185. This property corresponds to a disjunction (logical OR) of the following Allen temporal relations (Allen, 1983): {before, meets, overlaps, contains, finished-by}. This property is transitive. This property is asymmetric. https://cidoc-crm.org/html/version_images/images_7.1.3/image_07.png Figure 14: Temporal entity A starts before the start of temporal entity B. Here A is longer than B https://cidoc-crm.org/html/version_images/images_7.1.3/image_08.png Figure 15: Temporal entity A starts before the start of temporal entity B. Here A is shorter than B Examples of the inverse property: - The reign of King Harold II (E4) starts before the start of the Battle of Hastings (E7). (Wikipedia 2022a) - The life of Attila “the Hun” (E4) starts before the start of the Battle of the Catalaunian Plains (E7). [June 20, 451 AD] (Wikipedia 2022b) In First Order Logic of the inverse property: - P176(x,y) ⇒ E2(x) - P176(x,y) ⇒ E2(y) - P176(x,y) ⇒ P175(x,y) - [P176(x,y) ∧ P176(y,z)] ⇒ P176(x,z) - P176(x,y) ⇒ ¬P176(y,x)
domain: E2 Temporal Entity
label: P176 commence après le début de @fr
range: E2 Temporal Entity
sub property of: P175 starts after or with the start of
notation: P176i

P156 occupies
type: ObjectProperty
type: NamedIndividual
comment: Quantification: many to one (0,1:0,n) Scope note: This property describes the largest volume in space, an instance of E53 Place, that an instance of E18 Physical Thing has occupied at any time during its existence, with respect to the reference space relative to the physical thing itself. This allows for describing the thing itself as a place that may contain other things, such as a box that may contain coins. In other words, it is the volume that contains all the points which the thing has covered at some time during its existence. The reference space for the associated place must be the one that is permanently at rest (P157 is at rest relative to) relative to the physical thing. For instances of E19 Physical Objects it is the one which is at rest relative to the object itself, i.e., which moves together with the object. For instances of E26 Physical Feature it is one which is at rest relative to the physical feature itself and the surrounding matter immediately connected to it. Therefore, there is a 1:1 relation between the instance E18 Physical Thing and the instance of E53 Place it occupies. We include in the occupied space the space filled by the matter of the physical thing and all its inner spaces. This property implies the fully developed path from E18 Physical Thing through P196 defines, E92 Spacetime Volume, P161 has spatial projection to E53 Place. However, in contrast to P156 occupies, the property P161 has spatial projection does not constrain the reference space of the referred instance of E53 Place. In contrast to P156 occupies, for the property P53 has former or current location the following holds: It does not constrain the reference space of the referred instance of E53 Place. It identifies a possibly wider instance of E53 Place at which a thing is or has been for some unspecified time-span. If the reference space of the referred instance of E53 Place is not at rest with respect to the physical thing found there, the physical thing may move away af…
domain: E18 Physical Thing
label: P156 occupe @fr
range: E53 Place
sub property of: P157 provides reference space for
sub property of: P53 has former or current location
inverse of: P156 is occupied by
notation: P156

E30 Right
type: Class
type: NamedIndividual
comment: Scope note: This class comprises legal privileges concerning material and immaterial things or their derivatives. These include reproduction and property rights. Examples: - copyright held by ISO on ISO/CD 21127 - ownership of the “Mona Lisa” by the museum of the Louvre, Paris, France In First Order Logic: - E30(x) ⇒ E89(x)
label: E30 Direitos @pt
label: E30 Droit @fr
label: E30 Recht @de
label: E30 Δικαίωμα @el
label: E30 Право @ru
label: E30 权限 @zh
subclass of: E89 Propositional Object
subclass of: Restriction
  on property: P104 applies to
  some values from: E72 Legal Object
notation: E30

P185 ends after the end of
type: ObjectProperty
type: TransitiveProperty
type: NamedIndividual
comment: Quantification of the inverse property: many to many (0,n:0,n) Scope note of the inverse property: This property specifies that the temporal extent of the domain instance A of E2 Temporal Entity ends definitely before the end of the temporal extent of the range instance B of E2 Temporal Entity. In other words, if A = [A(start), A(end)] and B = [B(start), B(end)], it means A(end) < B(end )is true. This property is part of the set of temporal primitives P173 – P176, P182 – P185. This property corresponds to a disjunction (logical OR) of the following Allen temporal relations (Allen, 1983): {before, meets, overlaps, starts, during}. This property is transitive. This property is asymmetric. https://cidoc-crm.org/html/version_images/images_7.1.3/image_15.png Figure 22: Temporal entity A ends before the end of temporal entity B. Here A is longer than B https://cidoc-crm.org/html/version_images/images_7.1.3/image_16.png Figure 23: Temporal entity A ends before the end of temporal entity B. Here A is shorter than B Examples of the inverse property: - Godstow Abbey, Oxfordshire as a working abbey (E4 Period) ends before the end of the reign of Henry VIII (E4 Period). In First Order Logic of the inverse property: - P185(x,y) ⇒ E2(x) - P185(x,y) ⇒ E2(y) - P185(x,y) ⇒ P184(x,y) - [P185(x,y) ∧ P185(y,z)] ⇒ P185(x,z)P185(x,y) ⇒ ¬P185(y,x)
domain: E2 Temporal Entity
label: P185 se termine après la fin de @fr
range: E2 Temporal Entity
sub property of: P184 ends with or after the end of
notation: P185i

E92 Spacetime Volume
type: Class
type: NamedIndividual
comment: Scope note: This class comprises 4-dimensional point sets (volumes) in physical spacetime (in contrast to mathematical models of it) regardless of their true geometric forms. They may derive their identity from being the extent of a material phenomenon or from being the interpretation of an expression defining an extent in spacetime. Intersections of instances of E92 Spacetime Volume, E53 Place, and E52 Time-Span are also regarded as instances of E92 Spacetime Volume. An instance of E92 Spacetime Volume is either contiguous or composed of a finite number of contiguous subsets. Its boundaries may be fuzzy due to the properties of the phenomena it derives from or due to the limited precision up to which defining expression can be identified with a real extent in spacetime. The duration of existence of an instance of E92 Spacetime Volume is its projection on time. Examples: - the extent in space and time of the Event of Caesar’s murder (Irwin, 1935) - where and when the carbon 14 dating of the “Schoeninger Speer II” in 1996 took place (Kouwenhoven, 1997) - the spatio-temporal trajectory of the H.M.S. Victory from its building to its actual location (Goodwin, 2015) - the extent in space and time defined by a polygon approximating the Danube river flood in Austria between 6(th) and 9(th) August 2002 In First Order Logic: - E92(x) ⇒ E1(x)
label: E92 Volume spatio-temporel @fr
subclass of: E1 CRM Entity
notation: E92

P107 is current or former member of
type: ObjectProperty
type: NamedIndividual
comment: Quantification of the inverse property: many to many (0,n:0,n) Scope note of the inverse property: This property associates an instance of E74 Group with an instance of E39 Actor that is or has been a member thereof. Instances of E74 Group and E21 Person may all be members of instances of E74 Group. An instance of E74 Group may be founded initially without any member. This property is a shortcut of the more fully developed path from E74 Group, P144i gained member by, E85 Joining, P143 joined to E39 Actor. The property P107.1 kind of member can be used to specify the type of membership or the role the member has in the group. Examples of the inverse property: - László Moholy-Nagy (E21) is current or former member of Bauhaus (E74). (Moholy-Nagy, 2012) - National Museum of Science and Industry (E74) has current or former member The National Railway Museum (E74). (Rolt, 1971) - The married couple Queen Elisabeth and Prince Phillip (E74) has current or former member Prince Phillip (E21) kind of member husband (E55). (Brandreth, 2004) In First Order Logic of the inverse property: - P107(x,y) ⇒ E74(x) - P107(x,y) ⇒ E39(y) - P107(x,y,z) ⇒ [P107(x,y) ∧ E55(z)] - P107(x,y) ⇐ (∃z) [E85(z) ˄ P144i(x,z) ˄ P143(z,y)]
domain: E39 Actor
label: P107 est le membre actuel ou antérieur de @fr
label: P107 ist derzeitiges oder früheres Mitglied von @de
label: P107 é ou foi membro de @pt
label: P107 είναι ή ήταν μέλος του/της @el
label: P107 является действующим или бывшим членом @ru
label: P107 是当前或以往成员 @zh
range: E74 Group
notation: P107i

P44 has condition
type: ObjectProperty
type: NamedIndividual
comment: Quantification: one to many, dependent (0,n:1,1) Scope note: This property records an E3 Condition State for some E18 Physical Thing. This property is a shortcut of the more fully developed path from E18 Physical Thing through P34i was assessed by, E14 Condition Assessment, P35 has identified to E3 Condition State. It offers no information about how and when the E3 Condition State was established, nor by whom. An instance of E3 Condition State is specific to an instance of E18 Physical Thing. Examples: - Silver cup 232 (E22) has condition oxidation traces were present in 1997 (E3). [which has type (P2) oxidation traces (E55)] (fictitious) In First Order Logic: - P44(x,y) ⇒ E18(x) - P44(x,y) ⇒ E3(y) - P44(x,y) ⇐ (∃z) [E14(z) ˄ P34i(x,z) ˄ P35(z,y)]
domain: E18 Physical Thing
domain: E31 Document
label: P44 a pour état matériel @fr
label: P44 hat Zustand @de
label: P44 tem estado material @pt
label: P44 έχει κατάσταση @el
label: P44 имеет условие @ru
label: P44 有状况 @zh
range: E3 Condition State
inverse of: P44 is condition of
notation: P44

E33 Linguistic Object
type: Class
type: NamedIndividual
comment: Scope note: This class comprises identifiable expressions in natural language or languages. Instances of E33 Linguistic Object can be expressed in many ways: e.g. as written texts, recorded speech, or sign language. However, the CIDOC CRM treats instances of E33 Linguistic Object independently from the medium or method by which they are expressed. Expressions in formal languages, such as computer code or mathematical formulae, are not treated as instances of E33 Linguistic Object by the CIDOC CRM. These should be modelled as instances of E73 Information Object. In general, an instance of E33 Linguistic Object may also contain non-linguistic information, often of artistic or aesthetic value. Only in cases in which the content of an instance of E33 Linguistic Object can completely be expressed by a series of binary-encoded symbols, its content may be documented within a respective knowledge base by the property P190 has symbolic content: E62 String. Otherwise, it should be understood as an identifiable digital resource only available independently from the respective knowledge base. In other cases, such as pages of an illuminated manuscript or recordings containing speech in a language supported by a writing system, the linguistic part of the content of an instance of E33 Linguistic Object may be documented within a respective knowledge base in a note by P3 has note: E62 String. Otherwise, it may be described using the property P165 incorporates (is incorporated in): E73 Information Object as a different object with its own identity. Examples: - the text of the Ellesmere Chaucer manuscript (Hilmo, 2019) - the lyrics of the song “Blue Suede Shoes” (Cooper, 2008) - the text of the “Jabberwocky” by Lewis Carroll (Carroll, 1981) - the text of “Doktoro Jekyll kaj Sinjoro Hyde” [an Esperanto translation of Dr. Jekyll and Mr. Hyde]. (Stevenson, Morrison and Mann, 1909) - the free dialog in the local dialect recorded in 1958, Telemark, Norway stored on tape or.7-89.s1 (00.15:…
label: E33 Objet linguistique @fr
label: E33 Objeto Lingüístico @pt
label: E33 Sprachlicher Gegenstand @de
label: E33 Γλωσσικό Αντικείμενο @el
label: E33 Линвистический Объект @ru
label: E33 语言对象 @zh
subclass of: E73 Information Object
subclass of: Restriction
  min cardinality: 1
  on property: P72 has language
subclass of: Restriction
  max cardinality: 1
  on property: P73 is translation of
notation: E33

E2 Temporal Entity
type: Class
type: NamedIndividual
comment: Scope note: This class comprises all phenomena, such as the instances of E4 Periods and E5 Events, which happen over a limited extent in time. This extent in time must be contiguous, i.e., without gaps. In case the defining kinds of phenomena for an instance of E2 Temporal Entity cease to happen, and occur later again at another time, we regard that the former instance of E2 Temporal Entity has ended and a new instance has come into existence. In more intuitive terms, the same event cannot happen twice. In some contexts, such phenomena are also called perdurants. This class is disjoint from E77 Persistent Item and is an abstract class that typically has no direct instances. E2 Temporal Entity is specialized into E4 Period, which applies to a particular geographic area (defined with a greater or lesser degree of precision), and E3 Condition State, which applies to instances of E18 Physical Thing. Examples: - Bronze Age (E4) (Childe, 1963) - the earthquake in Lisbon 1755 (E5) (Chester, 2001) - the Peterhof Palace near Saint Petersburg being in ruins from 1944 to 1946 (E3) (Maddox, 2015) In First Order Logic: - E2(x) ⇒ E1(x)
label: E2 Entidade Temporal @pt
label: E2 Entité temporelle @fr
label: E2 Geschehendes @de
label: E2 Έγχρονη Οντότητα @el
label: E2 Временная Сущность @ru
label: E2 时序实体 @zh
subclass of: E1 CRM Entity
subclass of: Restriction
  cardinality: 1
  on property: P4 has time-span
disjoint with: E77 Persistent Item
notation: E2

P172 contains
type: DatatypeProperty
type: NamedIndividual
comment: Quantification: many to many (0,n:0,n) Scope note: This property describes a minimum spatial extent which is contained within an instance of E53 Place. Since instances of E53 Place may not have precisely known spatial extents, the CIDOC CRM supports statements about minimum spatial extents of instances of E53 Place. This property allows an instance of E53 Place’s minimum spatial extent (i.e., its inner boundary or a point being within a Place) to be assigned an instance of E94 Space Primitive value. This property is a shortcut of the fully developed path from E53 Place, P89i contains, E53 Place, P168 place is defined by to E94 Space Primitive. Examples: - The spatial extent of the Acropolis of Athens (E53) contains POINT (37.971431 23.725947) (E94). In First Order Logic: - P172(x,y) ⇒ E53(x) - P172(x,y) ⇒ E94(y) - P172(x,y) ⇔ (∃z) [E53(z) ˄ P89i(x,z) ˄ P168(z,y)]
domain: E53 Place
label: P172 contient @fr
notation: P172

E68 Dissolution
type: Class
type: NamedIndividual
comment: Scope note: This class comprises the events that result in the formal or informal termination of an instance of E74 Group. If the dissolution was deliberate, the Dissolution event should also be instantiated as an instance of E7 Activity. Examples: - the fall of the Roman Empire (Whittington, 1964) - the liquidation of Enron Corporation (Atlas, 2001) In First Order Logic: - E68(x) ⇒ E64(x)
label: E68 Dissolução @pt
label: E68 Gruppenauflösung @de
label: E68 Διάλυση Ομάδας @el
label: E68 Роспуск @ru
label: E68 解散 @zh
subclass of: E64 End of Existence
subclass of: Restriction
  on property: P99 dissolved
  some values from: E74 Group
notation: E68

P168 place is defined by
type: DatatypeProperty
type: NamedIndividual
comment: Quantification: one to many, dependent (0,n:1,1) Scope note: This property associates an instance of E53 Place with an instance of E94 Space Primitive that defines it. Syntactic variants or use of different scripts may result in multiple instances of E94 Space Primitive defining exactly the same place. Transformations between different reference systems always result in new definitions of places approximating each other and not in alternative definitions. Examples: - The centroid from https://sws.geonames.org/735927 (E53) place is defined by 40°31'17.9"N 21°15'48.3"E (E94). [A single point for approximating the centre of the city of Kastoria, Greece] - Martin’s coordinates for Kastoria (E53) place is defined by 40°30'23"N 21°14'53"E, 40°31'40"N 21°16'43"E (E94). [A square covering the built settlement structure of Kastoria, Greece] - Martin’s centroid for Kastoria (E53) place is defined by 40°31'01.5"N 21°15'48"E (E94). [A point in the lake of Kastoria in the centre of the area covered by the city] - The position measured by Alexander von Humboldt for the Plaza Mayor in Cumaná, Sucre, Venezuela 1799-1800AD (E53) place is defined by 10°27'52"N 66°30'02"W (E94). [West of the Observatory of Paris = 64°09'51"W of Greenwich, actually 1.1km east of today’s Plaza Andrés Eloy Blanco of Cumaná] (Humboldt, 1859) In First Order Logic: - P168(x,y) ⇒ E53(x) - P168(x,y) ⇒ E94(y)
domain: E53 Place
label: P168 lieu défini par @fr
notation: P168

E20 Biological Object
type: Class
type: NamedIndividual
comment: Scope note: This class comprises individual items of a material nature, which live, have lived, or are natural products of or from living organisms. Artificial objects that incorporate biological elements, such as Victorian butterfly frames, can be documented as both instances of E20 Biological Object and E22 Human-Made Object. Examples: - me (fictitious) - Tut-Ankh-Amun (Edwards and Boltin, 1979) - Boukephalus [Horse of Alexander the Great] (Lamb, 2005) - petrified dinosaur excrement PA1906-344 In First Order Logic: - E20(x) ⇒ E19(x)
label: E20 Biologischer Gegenstand @de
label: E20 Objet biologique @fr
label: E20 Objeto Biológico @pt
label: E20 Βιολογικό Ακτικείμενο @el
label: E20 Биологический Объект @ru
label: E20 生物对象 @zh
subclass of: E19 Physical Object
notation: E20

P177 is type of property assigned
type: ObjectProperty
type: NamedIndividual
comment: Quantification of the inverse property: many to many, necessary (1,n:0,n) Scope note of the inverse property: This property associates an instance of E13 Attribute Assignment with the type of property or relation that this assignment maintains to hold between the item to which it assigns an attribute and the attribute itself. Note that the properties defined by the CIDOC CRM also constitute instances of E55 Type themselves. The direction of the assigned property of type is understood to be from the attributed item (the range of property P140 assigned attribute to) to the attribute item (the range of the property P141 assigned). More than one property type may be assigned to hold between two items. A comprehensive explanation about refining CIDOC CRM concepts by E55 Type is given in the section “About Types” in the section on “Specific Modelling Constructs” of this document. Examples of the inverse property: - The Current Ownership Assessment of Martin Doerr’s silver cup February 1997 (E13) assigned property of type P52 has former or current owner (is former or current keeper of) (E55). (fictitious) - 1(st) June 1997 Identifier Assignment of the silver cup donated by Martin Doerr (E15) assigned property of type P48 has preferred identifier (is preferred identifier of) (E55). (fictitious) - The examination of MS Sinai Greek 418 (E13) assigned property of type binding structure type (E55). [‘binding structure type’ refers to a property, external to the CIDOC CRM, which connects a book (E22) to the type of its binding structure (E55)] (Honey & Pickwoad, 2010) - The condition assessment of the endband cores of MS Sinai Greek 418 (E14) assigned property of type damage (E55). [‘damage’ refers to a property, external to the CIDOC CRM, which connects an instance of a physical thing like an endband core (E22) to the type of damage (E55) it shows] (Honey & Pickwoad, 2010) - The condition assessment of the cover of MS Sinai Greek 418 (E14) assigned property of type quality (E55…
domain: E55 Type
label: P177 est le type de propriété assigné @fr
range: E13 Attribute Assignment
sub property of: P2 is type of
notation: P177i

E24 Physical Human-Made Thing
type: Class
type: NamedIndividual
comment: Scope note: This class comprises all persistent physical items of any size that are purposely created by human activity. This class comprises, besides others, human-made objects, such as a sword, and human-made features, such as rock art. For example, a “cup and ring” carving on bedrock is regarded as instance of E24 Physical Human-Made Thing. Instances of E24 Physical Human-Made Thing may be the result of modifying pre-existing physical things, preserving larger parts or most of the original matter and structure, which poses the question if they are new or even human-made, the respective interventions of production made on such original material should be obvious and sufficient to regard that the product has a new, distinct identity and intended function and is human-made. Substantial continuity of the previous matter and structure in the new product can be documented by describing the production process also as an instance of E81 Transformation. Whereas interventions of conservation and repair are not regarded to produce a new instance of E24 Physical Human-Made Thing, the results of preparation of natural history specimens that substantially change their natural or original state should be regarded as instances of E24 Physical Human-Made Things, including the uncovering of petrified biological features from a solid piece of stone. On the other side, scribbling a museum number on a natural object should not be regarded to make it human-made. This notwithstanding, parts, sections, segments, or features of an instance of E24 Physical Human-Made Thing may continue to be non-human-made and preserved during the production process, for example natural pearls used as a part of an eardrop. Examples: - the Forth Railway Bridge (Shipway, Bouch, Baker and Fowler, 1990). - the Channel Tunnel (E25) (Holliday, Marcou and Vickerman, 1991) - the Palace of Knossos (Evans, 1921) - the Colosseum in Rome, Italy (Hopkins and Beard, 2011) - the Historical Collection of the Museum Benak…
label: E24 Chose matérielle élaborée par l’humain @fr
subclass of: E18 Physical Thing
subclass of: E71 Human-Made Thing
subclass of: Restriction
  on property: P108 was produced by
  some values from: E12 Production
notation: E24

P82b end of the end
type: DatatypeProperty
type: NamedIndividual
domain: E52 Time-Span
label: P82b Ende vom Ende @de
label: P82b fim do fim @pt
label: P82b fin de la fin @fr
label: P82b τέλος του τέλους @el
label: P82b конец конец @ru
sub property of: P82 at some time within
notation: P82b

P176 starts before the start of
type: ObjectProperty
type: TransitiveProperty
type: NamedIndividual
comment: Quantification: many to many (0,n:0,n) Scope note: This property specifies that the temporal extent of the domain instance A of E2 Temporal Entity starts definitely before the start of the temporal extent of the range instance B of E2 Temporal Entity. In other words, if A = [A(start), A(end)] and B = [B(start), B(end)], it means A(start) < B(start) is true. This property is part of the set of temporal primitives P173 – P176, P182 – P185. This property corresponds to a disjunction (logical OR) of the following Allen temporal relations (Allen, 1983): {before, meets, overlaps, contains, finished-by}. This property is transitive. This property is asymmetric. https://cidoc-crm.org/html/version_images/images_7.1.3/image_07.png Figure 14: Temporal entity A starts before the start of temporal entity B. Here A is longer than B https://cidoc-crm.org/html/version_images/images_7.1.3/image_08.png Figure 15: Temporal entity A starts before the start of temporal entity B. Here A is shorter than B Examples: - The reign of King Harold II (E4) starts before the start of the Battle of Hastings (E7). (Wikipedia 2022a) - The life of Attila “the Hun” (E4) starts before the start of the Battle of the Catalaunian Plains (E7). [June 20, 451 AD] (Wikipedia 2022b) In First Order Logic: - P176(x,y) ⇒ E2(x) - P176(x,y) ⇒ E2(y) - P176(x,y) ⇒ P175(x,y) - [P176(x,y) ∧ P176(y,z)] ⇒ P176(x,z) - P176(x,y) ⇒ ¬P176(y,x)
domain: E2 Temporal Entity
label: P176 commence avant le début de @fr
range: E2 Temporal Entity
sub property of: P175 starts before or with the start of
inverse of: P176 starts after the start of
notation: P176

P38 deassigned
type: ObjectProperty
type: NamedIndividual
comment: Quantification: many to many (0,n:0,n) Scope note: This property records the identifier that was deassigned from an instance of E1 CRM Entity. De-assignment of an identifier may be necessary when an item is taken out of an inventory, a new numbering system is introduced or items are merged or split up. The same identifier may be deassigned on more than one occasion. Examples: - The identifier assignment on 31(st) July 2001 of the silver cup OXCMS:2001.1.32 (E15) deassigned “232” (E42). (fictitious) In First Order Logic: - P38(x,y) ⇒ E15(x) - P38(x,y) ⇒ E42(y) - P38(x,y) ⇒ P141(x,y)
domain: E15 Identifier Assignment
label: P38 a retiré l'assignation @fr
label: P38 hob Zuweisung auf von @de
label: P38 retirou a atribuição do @pt
label: P38 ακύρωσε @el
label: P38 отменил назначение @ru
label: P38 取消了 @zh
range: E42 Identifier
sub property of: P141 assigned
inverse of: P38 was deassigned by
notation: P38

P65 shows visual item
type: ObjectProperty
type: NamedIndividual
comment: Quantification: many to many (0,n:0,n) Scope note: This property documents an instance of E36 Visual Item shown by an instance of E24 Physical Human-Made Thing. This property is similar to P62 depicts (is depicted by) in that it associates an instance of E24 Physical Human-Made Thing with a visual representation. However, P65 shows visual item (is shown by) differs from the P62 depicts (is depicted by) property in that it makes no claims about what the instance of E36 Visual Item is deemed to represent. An instance of E36 Visual Item identifies a recognisable image or visual symbol, regardless of what this image may or may not represent. For example, all recent British coins bear a portrait of Queen Elizabeth II, a fact that is correctly documented using P62 depicts (is depicted by). Different portraits have been used at different periods, however. P65 shows visual item (is shown by) can be used to refer to a particular portrait. P65 shows visual item (is shown by) may also be used for Visual Items such as signs, marks and symbols, for example the 'Maltese Cross' or the 'copyright symbol’ that have no particular representational content. This property is part of the fully developed path E24 Physical Human-Made Thing, P65 shows visual item, E36 Visual Item, P138 represents to E1 CRM Entity which is shortcut by, P62 depicts (is depicted by). Examples: - My T-Shirt (E22) shows visual item Mona Lisa (E36). (fictitious) In First Order Logic: - P65(x,y) ⇒ E24(x) - P65(x,y) ⇒ E36(y) - P65(x,y) ⇒ P128(x,y)
domain: E24 Physical Human-Made Thing
label: P65 apresenta item visual @pt
label: P65 représente l'entité visuelle @fr
label: P65 zeigt Bildliches @de
label: P65 εμφανίζει οπτικό στοιχείο @el
label: P65 показывает визуальный предмет @ru
label: P65 展示可视项 @zh
range: E36 Visual Item
sub property of: P128 carries
inverse of: P65 is shown by
notation: P65

P198 is held or supported by
type: ObjectProperty
type: TransitiveProperty
type: NamedIndividual
comment: Quantification of the inverse property: one to many (0,n:0,n) Scope note of the inverse property: This property relates one instance of E18 Physical Thing which acts as a container or support to a supported or contained instance of E18 Physical Thing. Typical examples of E18 Physical Things which are intended to function as a container or support include shelves, folders or boxes. These containers or supports provide a stable surface which is intended for other physical objects to be placed upon for storage, display, transport or other similar functions. This property is a shortcut of the more fully developed path from E18 Physical Thing through P59 has section, E53 Place, P53i is former or current location of, to E18 Physical Thing. It is not a sub-property of P46 is composed of, as the held or supported object is not a component of the container or support. This property can be used to avoid explicitly instantiating the E53 Place which is defined by an instance of E18 Physical Thing, especially when the only intended use of that instance of E18 Physical Thing is to act as a container or surface for the storage of other instances of E18 Physical Thing. The place’s existence is defined by the existence of the container or surface, and will go out of existence at the same time as the destruction of the container or surface. This property is transitive. This property is asymmetric. Examples of the inverse property: - Archival folder “6” (E22) holds or supports the piece of paper carrying the text of a letter from Lawrence Alloway to Sylvia Sleigh (E22). - [ http://archives2.getty.edu:8082/xtf/view?docId=ead/2003.M.46/2003.M.46.xml;chunk.id=aspace_ref12_kf7;brand=default] - Archival folder "17" (E22) holds or supports the daguerreotype that shows the image of Henry Ward Beecher as a young man (E22). - [ https://archives.yale.edu/repositories/12/archival_objects/1402266] - Box "88" (E22) holds or supports folder "17" (E22). [ https://archives.yale.edu/repositories/12/ar…
domain: E18 Physical Thing
label: P198 est contenu ou soutenu par @fr
range: E18 Physical Thing
notation: P198i

P108 has produced
type: ObjectProperty
type: NamedIndividual
comment: Quantification: one to many, necessary, dependent (1,n:1,1) Scope note: This property identifies the instance of E24 Physical Human-Made Thing that came into existence as a result of the instance of E12 Production. The identity of an instance of E24 Physical Human-Made Thing is not defined by its matter, but by its existence as a subject of documentation. An E12 Production can result in the creation of multiple instances of E24 Physical Human-Made Thing. Examples: - The building of Rome (E12) has produced the Colosseum (E24). (Hopkins & Beard, 2011) In First Order Logic: - P108(x,y) ⇒ E12(x) - P108(x,y) ⇒ E24(y) - P108(x,y) ⇒ P31(x,y) - P108(x,y) ⇒ P92(x,y)
domain: E12 Production
label: P108 a produit @fr
label: P108 hat hergestellt @de
label: P108 produziu @pt
label: P108 παρήγαγε @el
label: P108 произвел @ru
label: P108 已产生了 @zh
range: E24 Physical Human-Made Thing
sub property of: P31 has modified
sub property of: P92 brought into existence
inverse of: P108 was produced by
notation: P108

P52 is current owner of
type: ObjectProperty
type: NamedIndividual
comment: Quantification of the inverse property: many to many (0,n:0,n) Scope note of the inverse property: This property identifies the instance of E21 Person or E74 Group that was the owner of an instance of E18 Physical Thing at the time of validity of the record or database containing the statement that uses this property. This property is a shortcut for the more detailed path from E18 Physical Thing through, P24i changed ownership through, E8 Acquisition, P22 transferred title to to E39 Actor, if and only if this acquisition event is the most recent. Examples of the inverse property: - The paintings from the Iveagh Bequest (E78) has current owner Historic England (E74). [This is still valid 2021 CE. The important collection of Old Master and British portraits was bequeathed to Kenwood by Edward Cecil Guinness, 1(st) Earl of Iveagh, in 1927.] (Iveagh Bequest, 1975; Bryant, 1990) In First Order Logic of the inverse property: - P52(x,y) ⇒ E18(x) - P52(x,y) ⇒ E39(y) - P52(x,y) ⇒ P51(x,y) - P52(x,y) ⇒ P105(x,y) - P52(x,y) ⇐ (∃z) [[E8(z) ˄ P24i(x,z) ˄ P22(z,y) ] - ˄ ¬ (∃w) [E8(w) ˄ P24i(x,w) ˄ P23(w,y)˄ P182(z,w)]]
domain: E39 Actor
label: P52 est l'actant propriétaire actuel de @fr
label: P52 ist derzeitiger Besitzer von @de
label: P52 é proprietário de @pt
label: P52 είναι ιδιοκτήτης του @el
label: P52 является текущим владельцем для @ru
label: P52 是当前所有者 @zh
range: E18 Physical Thing
sub property of: P105 has right on
sub property of: P51 is former or current owner of
notation: P52i

E52 Time-Span
type: Class
type: NamedIndividual
comment: Scope note: This class comprises abstract temporal extents, in the sense of Galilean physics, having a beginning, an end, and a duration. Instances of E52 Time-Span have no semantic connotations about phenomena happening within the temporal extent they represent. They do not convey any meaning other than a positioning on the “time-line” of chronology. The actual extent of an instance of E52 Time-Span can be approximated by properties of E52 Time-Span giving inner and outer bounds in the form of dates (instances of E61 Time Primitive). Comparing knowledge about time-spans is fundamental for chronological reasoning. Some instances of E52 Time-Span may be defined as the actual, in principle observable, temporal extent of instances of E2 Temporal Entity via the property P4 has time-span (is time-span of): E52 Time-Span. They constitute phenomenal time-spans as defined in CRMgeo (Doerr & Hiebel 2013). Since our knowledge of history is imperfect and physical phenomena are fuzzy in nature, the extent of phenomenal time-spans can only be described in approximation. An extreme case of approximation, might, for example, define an instance of E52 Time-Span having unknown beginning, end and duration. It may, nevertheless, be associated with other descriptions by which people can infer knowledge about it, such as in relative chronologies. Some instances of E52 may be defined precisely as representing a declaration of a temporal extent, as, for instance, done in a business contract. They constitute declarative time-spans as defined in CRMgeo (Doerr & Hiebel 2013) and can be described via the property E61 Time Primitive P170 defines time (time is defined by): E52 Time-Span. When used as a common E52 Time-Span for two events, it will nevertheless describe them as being simultaneous, even if nothing else is known. Examples: - 1961 - From 12-17-1993 to 12-8-1996 - 14h30 to 16h22 4(th) July 1945 - 9.30 am 1.1.1999 to 2.00 pm 1.1.1999 - the time-span of the Ming Dynasty (Chan, 2011) In…
label: E52 Intervalle temporel @fr
label: E52 Período de Tempo @pt
label: E52 Zeitspanne @de
label: E52 Χρονικό Διάστημα @el
label: E52 Интервал Времени @ru
label: E52 时段 @zh
subclass of: E1 CRM Entity
subclass of: Restriction
  on property: P4 is time-span of
  some values from: E2 Temporal Entity
notation: E52

P54 has current permanent location
type: ObjectProperty
type: NamedIndividual
comment: Quantification: many to one (0,1:0,n) Scope note: This property records the foreseen permanent location of an instance of E19 Physical Object at the time of validity of the record or database containing the statement that uses this property. P54 has current permanent location (is current permanent location of) is similar to P55 has current location (currently holds). However, it indicates the E53 Place currently reserved for an object, such as the permanent storage location or a permanent exhibit location. The object may be temporarily removed from the permanent location, for example when used in temporary exhibitions or loaned to another institution. The object may never actually be located at its permanent location. Examples: - Silver cup 232 (E22) has current permanent location Shelf 3.1, Store 2, Museum of Oxford (E53). (fictitious) In First Order Logic: - P54(x,y) ⇒ E19(x) - P54(x,y) ⇒ E53(y)
domain: E19 Physical Object
label: P54 a actuellement pour localisation fixe @fr
label: P54 hat derzeitigen permanenten Standort @de
label: P54 é localizado permanentemente em @pt
label: P54 έχει μόνιμη θέση @el
label: P54 имеет текущее постоянное местоположение @ru
label: P54 有当前永久位置 @zh
range: E53 Place
inverse of: P54 is current permanent location of
notation: P54

E69 Death
type: Class
type: NamedIndividual
comment: Scope note: This class comprises the deaths of human beings. If a person is killed, their death should be instantiated as E69 Death and as E7 Activity. The death or perishing of other living beings should be documented as instances of E64 End of Existence. Examples: - the murder of Julius Caesar (E69, E7) (Irwin, 1935) - the death of Senator Paul Wellstone (Monast and Tao, 2002) In First Order Logic: - E69(x) ⇒ E64(x)
label: E69 Mort @fr
label: E69 Morte @pt
label: E69 Tod @de
label: E69 Θάνατος @el
label: E69 Смерть @ru
label: E69 死亡 @zh
subclass of: E64 End of Existence
subclass of: Restriction
  on property: P100 was death of
  some values from: E21 Person
notation: E69

P32 used general technique
type: ObjectProperty
type: NamedIndividual
comment: Quantification: many to many (0,n:0,n) Scope note: This property identifies the technique or method, modelled as an instance of E55 Type, that was employed in an instance of E7 Activity. These techniques should be drawn from an external E55 Type hierarchy of consistent terminology of general techniques or methods such as embroidery, oil-painting, carbon dating, etc. Specific documented techniques should be described as instances of E29 Design or Procedure. Examples: - The ornamentation of silver cup 113 (E11) used general technique gold-plating (E55). [A Design or Procedure type] (fictitious) In First Order Logic: - P32(x,y) ⇒ E7(x) - P32(x,y) ⇒ E55(y) - P32(x,y) ⇒ P125(x,y)
domain: E7 Activity
label: P32 a mobilisé comme technique générale @fr
label: P32 benutzte das allgemeine Verfahren @de
label: P32 usou técnica geral @pt
label: P32 χρησιμοποίησε γενική τεχνική @el
label: P32 использовал общую технику @ru
label: P32 使用通用技术 @zh
range: E55 Type
sub property of: P125 used object of type
inverse of: P32 was technique of
notation: P32

P182 ends before or with the start of
type: ObjectProperty
type: NamedIndividual
comment: Quantification: many to many (0,n:0,n) Scope note: This property specifies that the temporal extent of the domain instance A of E2 Temporal Entity ends before or simultaneously with the start of the temporal extent of the range instance B of E2 Temporal Entity. In other words, if A = [A(start), A(end)] and B = [B(start), B(end)], it means A(end) ≤ B(start) is true. This property is part of the set of temporal primitives P173 – P176, P182 – P185. This property corresponds to a disjunction (logical OR) of the following Allen temporal relations (Allen, 1983): {before, meets}. This property is transitive. This property is asymmetric. https://cidoc-crm.org/html/version_images/images_7.1.3/image_09.png Figure 16: Temporal entity A ends before or with the start of temporal entity B. Here A is longer than B https://cidoc-crm.org/html/version_images/images_7.1.3/image_10.png Figure 17: Temporal entity A ends before or with the start of temporal entity B. Here A is shorter than B Examples: - Lerna III (E4) ends before or with the start of Lerna IV (E4). [“The site at Lerna probably was not left uninhabited for long after the destruction of the House of the Tiles and the raising of the tumulus. If there was a gap corresponding to the earliest stage of EH III in the Argolid, as has been suggested by some (see, e.g., Manning 1995: 55–60), it was a brief one. In Rutter’s view, the short life of the Fourth Settlement began ca. 2200/2150 b.c. and ended ca. 2050/2000 b.c.”] (Banks & Reese, 2013) - The use of LH I graves of Krisa in Phocis (E4) ends before or with the start of LH III phase of reuse of the graves of Krisa in Phocis (E4). [“…a possible hiatus in the occupation of certain sites such as the settlement of Krisa in Phocis, which was well occupied in the MH and LHIII periods. LHIIB pottery from this settlement has already been identified, but no certain example of LHIIA pottery.”] (Phialon 2018) In First Order Logic: - P182(x,y) ⇒ E2(x) - P182(x,y) ⇒ E2(y) - P182(x,y) ⇒ P17…
domain: E2 Temporal Entity
label: P182 se termine avant ou au moment du début de @fr
range: E2 Temporal Entity
sub property of: P176 starts before the start of
sub property of: P185 ends before the end of
inverse of: P182 starts after or with the end of
notation: P182

E34 Inscription
type: Class
type: NamedIndividual
comment: Scope note: This class comprises recognisable texts that can be attached to instances of E24 Physical Human-Made Thing. The transcription of the text can be documented in a note by P3 has note: E62 String. The alphabet used can be documented by P2 has type: E55 Type. This class is not intended to describe the idiosyncratic characteristics of an individual physical embodiment of an inscription, but the underlying prototype. The physical embodiment is modelled in the CIDOC CRM as instances of E24 Physical Human-Made Thing. The relationship of a physical copy of a book to the text it contains is modelled using E18 Physical Thing. P128 carries (is carried by): E33 Linguistic Object. Examples: - “keep off the grass” [on a sign stuck in the lawn of the quad of Balliol College, Oxford, UK] - the text published in Corpus Inscriptionum Latinarum V 895 (Mommsen, 1872) - “Kilroy was here” In First Order Logic: - E34(x) ⇒ E33(x) - E34(x) ⇒ E37(x)
label: E34 Inschrift @de
label: E34 Inscrição @pt
label: E34 Επιγραφή @el
label: E34 Надпись @ru
label: E34 题识 @zh
subclass of: E33 Linguistic Object
subclass of: E37 Mark
notation: E34

P16 used specific object
type: ObjectProperty
type: NamedIndividual
comment: Quantification: many to many (0,n:0,n) Scope note: This property describes the use of material or immaterial things in a way essential to the performance or the outcome of an instance of E7 Activity. This property typically applies to tools, instruments, moulds, raw materials and items embedded in a product. It implies that the presence of the object in question was a necessary condition for the action. For example, the activity of writing this text required the use of a computer. An immaterial thing can be used if at least one of its carriers is present. For example, the software tools on a computer. Another example is the use of a particular name by a particular group of people over some span to identify a thing, such as a settlement. In this case, the physical carriers of this name are at least the people understanding its use. Examples: - The writing of the scope note of the CIDOC CRM property “P16 used specific object” contained in the CIDOC CRM version 4.1 (E7) used specific object Nicholas Crofts’ computer (E22) mode of use Typing Tool; Storage Medium (E55). [the original scope note was later extended in the CIDOC CRM version 4.3] - The people of Iraq calling the place identified by TGN ‘7017998’ (E7) used specific object “Quyunjig” (E41) mode of use current; vernacular (E55). Properties: - P16.1 mode of use: E55 Type In First Order Logic: - P16(x,y) ⇒ E7(x) - P16(x,y) ⇒ E70(y) - P16(x,y) ⇒ P12(x,y) - P16(x,y) ⇒ P15(x,y) - P16(x,y,z) ⇒ [P16(x,y) ∧ E55(z)]
domain: E7 Activity
label: P16 a mobilisé l’objet spécifique @fr
label: P16 benutzte das bestimmte Objekt @de
label: P16 usou objeto específico @pt
label: P16 χρησιμοποίησε αντικείμενο @el
label: P16 использовал особый объект @ru
label: P16 使用特定对象 @zh
range: E70 Thing
sub property of: P12 occurred in the presence of
sub property of: P15 was influenced by
inverse of: P16 was used for
notation: P16

E16 Measurement
type: Class
type: NamedIndividual
comment: Scope note: This class comprises actions measuring physical properties and other values that can be determined by a systematic, objective procedure of direct observation of particular states of physical reality. An instance of E16 Measurement may use simple counting or tools, such as yardsticks or radiation detection devices. The interest is in the method and care applied, so that the reliability of the result may be judged at a later stage, or research continued on the associated documents. The date of the event is important for dimensions, which may change value over time, such as the length of an object subject to shrinkage. Methods and devices employed should be associated with instances of E16 Measurement by properties such as P33 used specific technique: E29 Design or Procedure, P125 used object of type: E55 Type, P16 used specific object (was used for): E70 Thing, whereas basic techniques such as "carbon-14 dating" should be encoded using P2 has type (is type of): E55 Type. Details of methods and devices reused or reusable in other instances of E16 Measurement should be documented for these entities rather than the measurements themselves, whereas details of particular execution may be documented by free text or by instantiating adequate sub-activities, if the detail may be of interest for an overarching query. Regardless whether a measurement is made by an instrument or by human senses, it represents the initial transition from physical reality to information without any other documented information object in between within the reasoning chain that would represent the result of the interaction of the observer or device with reality. Therefore, determining properties of an instance of E90 Symbolic Object is regarded as an instance of E13 Attribute Assignment, which may be inferred from observing and measuring representative carriers. In the case that the carrier can be named, the property P16 used specific object (was used for) should be used to indicate the …
label: E16 Medição @pt
label: E16 Messung @de
label: E16 Mesurage @fr
label: E16 Μέτρηση @el
label: E16 Событие Измерения @ru
label: E16 测量 @zh
subclass of: E13 Attribute Assignment
subclass of: Restriction
  on property: P40 observed dimension
  some values from: E54 Dimension
subclass of: Restriction
  cardinality: 1
  on property: P39 measured
notation: E16

P98 was born
type: ObjectProperty
type: NamedIndividual
comment: Quantification of the inverse property: one to many, dependent (0,n:1,1) Scope note of the inverse property: This property links an instance of E67 Birth event to an instance of E21 Person in the role of offspring. Twins, triplets etc. are brought into life by the same instance of E67 Birth. This is not intended for use with general Natural History material, only people. There is no explicit method for modelling conception and gestation except by using extensions. Examples of the inverse property: - The Birth of Queen Elizabeth II (E67) brought into life Queen Elizabeth II (E21). (Parker, 2002) In First Order Logic of the inverse property: - P98(x,y) ⇒ E67(x) - P98(x,y) ⇒ E21(y) - P98(x,y) ⇒ P92(x,y)
domain: E21 Person
label: P98 est né @fr
label: P98 veio à vida pelo @pt
label: P98 wurde geboren durch @de
label: P98 γεννήθηκε @el
label: P98 был рожден @ru
label: P98 被诞生 @zh
range: E67 Birth
sub property of: P92 was brought into existence by
notation: P98i

P180 has currency
type: ObjectProperty
type: NamedIndividual
comment: Quantification: many to one, necessary (1,1:0,n) Scope note: This property establishes the relationship between an instance of E97 Monetary Amount and the instance of E98 Currency that it is measured in. Examples: - Christie’s hammer price for Vincent van Gogh’s “Still Life: Vase with Fifteen Sunflowers” in London on 30(th) March 1987 (E97) has currency British Pounds (E98). In First Order Logic: - P180(x,y) ⇒ E97(x) - P180(x,y) ⇒ E98(y) - P180(x,y) ⇒ P91(x,y)
domain: E97 Monetary Amount
label: P180 a pour unité monétaire @fr
range: E98 Currency
sub property of: P91 has unit
inverse of: P180 was currency of
notation: P180

P136 was based on
type: ObjectProperty
type: NamedIndividual
comment: Quantification: many to many (0,n:0,n) Scope note: This property identifies one or more instances of E1 CRM Entity that were used as evidence to declare a new instance of E55 Type. The examination of these items is often the only objective way to understand the precise characteristics of a new type. Such items should be deposited in a museum or similar institution for that reason. The taxonomic role renders the specific relationship of each item to the type, such as “holotype” or “original element”. Examples: - The taxon creation of the plant species ‘Serratula glauca Linné, 1753.’ (E83) was based on Object BM000576251 of the Clayton Herbarium (E20) in the taxonomic role original element (E55). (Blake, 1918) Properties: - P136.1 in the taxonomic role: E55 Type In First Order Logic: - P136(x,y) ⇒ E83(x) - P136(x,y) ⇒ E1(y) - P136(x,y,z) ⇒ [P136(x,y) ∧ E55(z)] - P136(x,y) ⇒ P15(x,y)
domain: E83 Type Creation
label: P136 a été fondé sur @fr
label: P136 foi baseado em @pt
label: P136 stützte sich auf @de
label: P136 βασίστηκε σε @el
label: P136 был основан на @ru
label: P136 基于 @zh
range: E1 CRM Entity
sub property of: P15 was influenced by
inverse of: P136 supported type creation
notation: P136

P41 classified
type: ObjectProperty
type: NamedIndividual
comment: Quantification: many to one, necessary (1,1:0,n) Scope note: This property records the item to which a type was assigned in an E17 Type Assignment activity. Any instance of a CIDOC CRM entity may be assigned a type through type assignment. Type assignment events allow a more detailed path from E1 CRM Entity through P41i was classified by, E17 Type Assignment, P42 assigned, to E55 Type for assigning types to objects compared to the shortcut offered by P2 has type (is type of). Examples: - The classification of silver cup 232 on 31(st) August 1997 (E17) classified silver cup 232 (E22). (fictitious) In First Order Logic: - P41(x,y) ⇒ E17(x) - P41(x,y) ⇒ E1(y) - P41(x,y) ⇒ P140(x,y)
domain: E17 Type Assignment
label: P41 a classifié @fr
label: P41 classificou @pt
label: P41 klassifizierte @de
label: P41 χαρακτήρισε @el
label: P41 классифицировал @ru
label: P41 分类 @zh
range: E1 CRM Entity
sub property of: P140 assigned attribute to
inverse of: P41 was classified by
notation: P41

P101 was use of
type: ObjectProperty
type: NamedIndividual
comment: Quantification of the inverse property: many to many (0,n:0,n) Scope note of the inverse property: This property associates an instance of E70 Thing with an instance of E55 Type that describes the type of use that it was actually employed for. It allows the relationship between particular things, both physical and immaterial, and the general methods and techniques of real use to be documented. This may well be different from the intended functional purpose of the instance of E70 Thing (which can be documented with P103 was intended for (was intention of)). For example, it could be recorded that a particular wooden crate had a general use as a shelf support on a market stall even though it had been originally intended for carrying vegetables. The use of this property is intended to allow the documentation of usage patterns attested in historical records or through scientific investigation (for instance ceramic residue analysis). It should not be used to document the intended, and thus assumed, use of an object. Examples of the inverse property: - Tony Gill’s Ford Mustang (E22) had as general use transportation (E55). - The Egyptian unglazed vessel used in the 2003 study reported by Barnard et al. (E22) had as general use camel milk preparation (E55). (Barnard et al., 2007) In First Order Logic of the inverse property: - P101(x,y) ⇒ E70(x) - P101(x,y) ⇒ E55(y) - P101(x,y) ⇒ (∃z)[E7(z) ∧ P16i(,x,z) ∧ P2(z,y)]
domain: E55 Type
label: P101 a été l'usage général de @fr
label: P101 foi uso de @pt
label: P101 war die Verwendung von @de
label: P101 ήταν χρήση του/της @el
label: P101 был применением для @ru
label: P101 被用于 @zh
range: E70 Thing
notation: P101i

P39 was measured by
type: ObjectProperty
type: NamedIndividual
comment: Quantification of the inverse property: many to one, necessary (1,1:0,n) Scope note of the inverse property: This property associates an instance of E16 Measurement with the instance of E18 Physical Thing upon which it acted. The instance of E16 Measurement is specific to the measured object. An instance of E18 Physical Thing may be measured more than once with different results, constituting different instances of E16 Measurement. Examples of the inverse property: - The measurement of the height of silver cup 232 on 31(st) August 1997 (E16) measured silver cup 232 (E22). (fictitious) - The carbon 14 dating of the “Schoeninger Speer II” in 1996 (E16) measured the “Schoeninger Speer II” (E22). [The carbon 14 dating of an approximately 400.000 year old complete Old Palaeolithic wooden spear found in Schoeningen, Niedersachsen, Germany, in 1995. See also, E16 Measurement.] (Kouwenhoven, 1997) In First Order Logic of the inverse property: - P39(x,y) ⇒ E16(x) - P39(x,y) ⇒ E18(y) - P39(x,y) ⇒ P140(x,y)
domain: E18 Physical Thing
label: P39 a été mesuré par @fr
label: P39 foi medida por @pt
label: P39 wurde vermessen durch @de
label: P39 μετρήθηκε από @el
label: P39 был измерен посредством @ru
label: P39 被测量 @zh
range: E16 Measurement
sub property of: P140 was attributed by
notation: P39i

P160 has temporal projection
type: ObjectProperty
type: NamedIndividual
comment: Quantification: many to one, necessary (1,1:0,n) Scope note: This property describes the temporal projection of an instance of E92 Spacetime Volume. The property P4 has time-span is the same as P160 has temporal projection if it is used to document an instance of E4 Period or any subclass of it. Examples: - The spatio-temporal trajectory of the H.M.S. Temeraire from its building in 1798 to its destruction in 1838 (E92) has temporal projection the time-span of the existence of H.M.S. Temeraire (E52) [at some time within (P82) “1798-1838” (E61).] (Willis, 2010) - The Battle of Waterloo 1815 (E7) has temporal projection the time-span of the Battle of Waterloo (E52) [at some time within (P82) “Sunday, 18(th) June 1815” (E61).] (Black, 2010) In First Order Logic: - P160(x,y) ⇒ E92(x) - P160(x,y)⇒ E52(y)
domain: E92 Spacetime Volume
label: P160 a pour projection temporelle @fr
range: E52 Time-Span
inverse of: P160 is temporal projection of
notation: P160

P122 borders with
type: ObjectProperty
type: SymmetricProperty
type: NamedIndividual
comment: Quantification: many to many (0,n:0,n) Scope note: This symmetric property associates an instance of E53 Place with another instance of E53 Place which shares a part of its border. This property is purely spatial. It does not imply that the phenomena that define, by their extent, places related by P122 borders with have ever shared a respective border at the same time or even coexisted. In particular, this may be the case when the respective common border is formed by a natural feature. This property is not transitive. This property is symmetric. Examples: - Scotland in its 1603 borders (E53) borders with England in its 1603 borders (E53). (Crofton, 2015) In First Order Logic: - P122(x,y) ⇒ E53(x) - P122(x,y) ⇒ E53(y) - P122(x,y) ⇒ P122(y,x)
domain: E53 Place
label: P122 est limitrophe de @fr
label: P122 fronteira com @pt
label: P122 grenzt an @de
label: P122 συνορεύει με @el
label: P122 граничит с @ru
label: P122 接壤于 @zh
range: E53 Place
notation: P122

P89 contains
type: ObjectProperty
type: TransitiveProperty
type: NamedIndividual
comment: Quantification of the inverse property: many to many, necessary, dependent (1,n:1,n) Scope note of the inverse property: This property identifies an instance of E53 Place that falls wholly within the extent of another instance of E53 Place. It addresses spatial containment only and does not imply any relationship between things or phenomena occupying these places. This property is transitive and reflexive. Examples of the inverse property: - The area covered by the World Heritage Site of Stonehenge (E53) falls within the area of Salisbury Plain (E53). (Pryor, 2016) In First Order Logic of the inverse property: - P89(x,y) ⇒ E53(x) - P89(x,y) ⇒ E53(y) - [P89(x,y) ∧ P89(y,z)] ⇒ P89(x,z) - P89(x,x)
domain: E53 Place
label: P89 contient @fr
label: P89 contém @pt
label: P89 enthält @de
label: P89 περιέχει @el
label: P89 содержит @ru
label: P89 包括 @zh
range: E53 Place
notation: P89i

P69 is associated with
type: ObjectProperty
type: NamedIndividual
comment: Quantification of the inverse property: many to many (0,n:0,n) Scope note of the inverse property: This property generalises relationships like whole-part, sequence, prerequisite or inspired by between instances of E29 Design or Procedure. Any instance of E29 Design or Procedure may be associated with other designs or procedures. The property is considered to be symmetrical unless otherwise indicated by P69.1 has type. The property is not transitive. This property is a directed relationship. The P69.1 has type property of P69 has association with allows the nature of the association to be specified reading from domain to range; examples of types of association between instances of E29 Design or Procedure include: has part, follows, requires, etc. Instances of this property are considered to be symmetric, in case no directed sense is provided for them by the property P69.1 has type. The property can typically be used to model the decomposition of the description of a complete workflow into a series of separate procedures. Examples of the inverse property: - The procedure for glass blowing (E29) has association with the procedure for glass heating (E29). (Brooks, 1973) - The set of instructions for performing Macbeth in Max Reinhardt's production in 1916 in Berlin at Deutsches Theater (E29) has association with the scene design drawing by Ernst Stern reproduced at http://www.glopad.org/pi/fr/record/digdoc/1003814 (E29) has type has part (E55). - The preparation of parchment (E29) has association with soaking and unhairing of skin (E29) has type has part (E55). - Stretching of skin (E29) has association with soaking and unhairing of skin (E29) has type follows (E55). (Poole and Reed, 1962) - The plan for reassembling the temples at Abu Simbel (E29) has association with the plan for storing and transporting the blocks (E29) has type follows (E55). (Loubiere, 1995) In First Order Logic of the inverse property: - P69(x,y) ⇒ E29(x) - P69(x,y) ⇒ E29(y) - P69(x,y,z) ⇒ [P69(x…
domain: E29 Design or Procedure
label: P69 est associé à @fr
range: E29 Design or Procedure
notation: P69i

P8 witnessed
type: ObjectProperty
type: NamedIndividual
comment: Quantification of the inverse property: many to many (0,n:0,n) Scope note of the inverse property: This property describes the location of an instance of E4 Period with respect to an instance of E18 Physical Thing. This property is a shortcut of the more fully developed path from E4 Period through P7 took place at, E53 Place, P156i is occupied by to E18 Physical Thing. It describes a period that can be located with respect to the space defined by an E19 Physical Object such as a ship or a building. The precise geographical location of the object during the period in question may be unknown or unimportant. For example, the French and German armistice of 22(nd) June 1940 was signed in the same railway carriage as the armistice of 11(th) November 1918. Examples of the inverse property: - The coronation of Queen Elizabeth II (E7) took place on or within Westminster Abbey (E18). (Strong, 2005) In First Order Logic of the inverse property: - P8(x,y) ⇒ E4(x) - P8(x,y) ⇒ E18(y) - P8(x,y) ⇐ (∃z) [E53(z) ˄ P7(x,z) ˄ P156i(z,y)]
domain: E18 Physical Thing
label: P8 a été témoin de @fr
label: P8 bezeugte @de
label: P8 testemunhou @pt
label: P8 υπήρξε τόπος του @el
label: P8 являлся местом для @ru
label: P8 发生过 @zh
range: E4 Period
notation: P8i

P147 curated
type: ObjectProperty
type: NamedIndividual
comment: Quantification: many to many, necessary (1,n:0,n) Scope note: This property associates an instance of E87 Curation Activity with the instance of E78 Curated Holding with that is subject of that curation activity following some implicit or explicit curation plan. Examples: - The curation activity of the Benaki Museum for the Toys, Games and Childhood Collection (E87) curated The Toys, Games and Childhood Collection of the Benaki Museum (E78). [The curation activity included the acquisition of dolls and games of urban and folk manufacture dating from the 17(th) to the 20(th) century, from England, France and Germany for the Toys, Games and Childhood Collection of the museum.] (Benaki Museum, 2016) - The curation activity for the permanent Numismatic Collection of the Historical Museum of Crete, Heraklion, Crete from 2005 up to the present (E87) curated the Numismatic Collection (E78). (Historical Museum of Crete, 2005) - The curation activity of Mikael Heggelund Foslie (E87) curated the Mikael Heggelund Foslie’s coralline red algae Herbarium (E78). (Woelkerling et al., 2005) In First Order Logic: - P147(x,y) ⇒ E87(x) - P147(x,y) ⇒ E78(y)
domain: E87 Curation Activity
label: P147 a géré @fr
label: P147 betreute kuratorisch @de
label: P147 管理 @zh
range: E78 Curated Holding
inverse of: P147 was curated by
notation: P147

P103 was intended for
type: ObjectProperty
type: NamedIndividual
comment: Quantification: many to many (0,n:0,n) Scope note: This property links an instance of E71 Human-Made Thing to an instance of E55 Type of usage or audience. It creates a relation between specific human-made things, both physical and immaterial, to E55 Types. This property can be used to specify intended methods and techniques of use or to characterise the intended audience by indicating a type of personal characteristic that everyone falling into the target audience has. Note: A link between specific human-made things and a specific use activity should be expressed using P19 was intended use of (was made for). Examples: - This plate (E22) was intended for being destroyed at wedding reception (E55). (fictitious) - “Reading for life, a first book for adults and their tutors” (E28) was intended for adult literacy learners in the English language (E55). (Allen, 1987) - “Piglet has a bath” (E28), published on sealed plastic pages, was intended for young children having a bath (E55). (Milne & Shepard, 1998) In First Order Logic: - P103(x,y) ⇒ E71(x) - P103(x,y) ⇒ E55(y)
domain: E71 Human-Made Thing
label: P103 a eu pour raison d'être @fr
label: P103 bestimmt für @de
label: P103 era destinado à @pt
label: P103 προοριζόταν για @el
label: P103 был задуман для @ru
label: P103 被用于 @zh
range: E55 Type
inverse of: P103 was intention of
notation: P103

P190 has symbolic content
type: DatatypeProperty
type: NamedIndividual
comment: Quantification: many to many (0,n:0,n) Scope note: This property associates an instance of E90 Symbolic Object with a complete, identifying representation of its content in the form of an instance of E62 String. This property only applies to instances of E90 Symbolic Object that can be represented completely in this form. The representation may be more specific than the symbolic level defining the identity condition of the represented. This depends on the type of the symbolic object represented. For instance, if a name has type “Modern Greek character sequence”, it may be represented in a loss-free Latin transcription, meaning however the sequence of Greek letters. As another example, if the represented object has type “English words sequence”, American English or British English spelling variants may be chosen to represent the English word “colour” without defining a different symbolic object. If a name has type “European traditional name”, no particular string may define its content. Examples: - The materials description of the painting (E33) has symbolic content “Oil, French Watercolors on Paper, Graphite and Ink on Canvas, with an Oak frame.” (E62). - The title of Einstein’s 1915 text (E35) has symbolic content “Relativity, the Special and the General Theory” (E62). (Einstein, 2001) - The story of Little Red Riding Hood (E33) has symbolic content “Once upon a time there lived in a certain village.” (E62). (Lang, 1965) - The inscription on Rijksmuseum object SK-A-1601 (E34) has symbolic content “B” (E62). [reference: https://www.rijksmuseum.nl/en/collection/SK-A-1601/catalogue-entry (accessed 10(th) April 2021)] In First Order Logic: - P190(x,y) ⇒ E90(x) - P190(x,y) ⇒ E62(y)
domain: E90 Symbolic Object
label: P190 a pour contenu symbolique @fr
sub property of: P3 has note
notation: P190

P20 was purpose of
type: ObjectProperty
type: NamedIndividual
comment: Quantification of the inverse property: many to many (0,n:0,n) Scope note of the inverse property: This property describes the relationship between a preparatory activity, an instance of E7 Activity and the instance of E5 Event that it is intended as a preparation for. This includes activities, orders and other organisational actions, taken in preparation for other activities or events. P20 had specific purpose (was purpose of) implies that the activity succeeded in achieving its aim. If it does not succeed, such as the setting of a trap that did not catch anything, the unrealized intention should be documented using P21 had general purpose (was purpose of): E55 Type and/or P33 used specific technique (was used by): E29 Design or Procedure. Examples of the inverse property: - Van Eyck’s pigment grinding in 1432 (E7) had specific purpose the painting of the Ghent altar piece (E12). (Borchert, 2008) In First Order Logic of the inverse property: - P20(x,y) ⇒ E7(x) - P20(x,y) ⇒ E5(y)
domain: E5 Event
label: P20 a été la finalité de @fr
label: P20 era o propósito de @pt
label: P20 war Zweck von @de
label: P20 ήταν σκοπός του/της @el
label: P20 был целью для @ru
label: P20 是为了 @zh
range: E7 Activity
notation: P20i

P166 had presence
type: ObjectProperty
type: NamedIndividual
comment: Quantification of the inverse property: many to one, necessary (1,1:0,n) Scope note of the inverse property: This property associates an instance of E93 Presence with the instance of E92 Spacetime Volume of which it represents a temporal restriction (i.e. a time-slice). Instantiating this property constitutes a necessary part of the identity of the respective instance of E93 Presence. Examples of the inverse property: - The Roman Empire on 19(th) August AD 14 (E93) was a presence of The Roman Empire (E4). (Clare and Edwards, 1992) In First Order Logic of the inverse property: - P166(x,y) ⇒ E93(x) - P166(x,y) ⇒ E92(y) - P166(x,y) ⇒ P10(x,y)
domain: E92 Spacetime Volume
label: P166 a eu pour présence @fr
range: E93 Presence
sub property of: P10 contains
notation: P166i

P22 acquired title through
type: ObjectProperty
type: InverseFunctionalProperty
type: NamedIndividual
comment: Quantification of the inverse property: many to many (0,n:0,n) Scope note of the inverse property: This property identifies the instance of E39 Actor that acquires the legal ownership of an object as a result of an instance of E8 Acquisition. The property will typically describe an Actor purchasing or otherwise acquiring an object from another Actor. However, title may also be acquired without any corresponding loss of title by another Actor, through legal fieldwork such as hunting, shooting, or fishing. In reality, the title is either transferred to or from someone, or both. Examples of the inverse property: - The acquisition of the Amoudruz collection by the Geneva Ethnography Museum (E8) transferred title to the Geneva Ethnography Museum (E74). In First Order Logic of the inverse property: - P22(x,y) ⇒ E8(x) - P22(x,y) ⇒ E39(y) - P22(x,y) ⇒ P14(x,y)
domain: E39 Actor
label: P22 a acquis le titre de propriété par @fr
label: P22 adquiriu os direitos de propriedade por meio da @pt
label: P22 erwarb Besitztitel durch @de
label: P22 απέκτησε τον τίτλο μέσω @el
label: P22 получил право собственности через @ru
label: P22 获得所有权 @zh
range: E8 Acquisition
sub property of: P14 performed
notation: P22i

P46 is composed of
type: ObjectProperty
type: TransitiveProperty
type: NamedIndividual
comment: Quantification: many to many (0,n:0,n) Scope note: This property associates an instance of E18 Physical Thing with another instance of Physical Thing that forms part of it. The spatial extent of the composing part is included in the spatial extent of the whole. Component elements, since they are themselves instances of E18 Physical Thing, may be further analysed into sub-components, thereby creating a hierarchy of part decomposition. An instance of E18 Physical Thing may be shared between multiple wholes, for example two buildings may share a common wall. This property does not specify when and for how long a component element resided in the respective whole. If a component is not part of a whole from the beginning of existence or until the end of existence of the whole, the classes E79 Part Addition and E90 Part Removal can be used to document when a component became part of a particular whole and/or when it stopped being a part of it. For the time-span of being part of the respective whole, the component is completely contained in the place the whole occupies. This property is intended to describe specific components that are individually documented, rather than general aspects. Overall descriptions of the structure of an instance of E18 Physical Thing are captured by the P3 has note property. The instances of E57 Material of which an instance of E18 Physical Thing is composed should be documented using P45 consists of (is incorporated in). This property is transitive and asymmetric. Examples: - The Royal carriage (E22) forms part of the Royal train (E22). - The “Hog’s Back” (E24) forms part of the “Fosseway” (E24). In First Order Logic: - P46(x,y) ⇒ E18(x) - P46(x,y) ⇒ E18(y) - P46(x,y) ⇒ P132(x,y) - [P46(x,y) ∧ P46(y,z)] ⇒ P46(x,z) - P46(x,y) ⇒ (∃uzw)[E93(u) ∧ P195i (x,u) ∧ E52(z) ∧ P164(u,z) ∧ E93(w) ∧ P195i (w,y) ∧ P164(w,z) ∧ P10(w,u)] - P46(x,y) ⇒ ¬P46(y,x)
domain: E18 Physical Thing
label: P46 est composé de @fr
label: P46 ist zusammengesetzt aus @de
label: P46 é composto de @pt
label: P46 αποτελείται από @el
label: P46 составлен из @ru
label: P46 组成成分是 @zh
range: E18 Physical Thing
inverse of: P46 forms part of
notation: P46

P144 gained member by
type: ObjectProperty
type: NamedIndividual
comment: Quantification of the inverse property: many to many, necessary (1,n:0,n) Scope note of the inverse property: This property identifies the instance of E74 Group of which an instance of E39 Actor becomes a member through an instance of E85 Joining. Although a joining activity normally concerns only one instance of E74 Group, it is possible to imagine circumstances under which becoming member of one Group implies becoming member of another Group as well. Joining events allow for describing people becoming members of a group with a more detailed path from E74 Group through, P144i gained member by, E85 Joining, P143 joined, E39 Actor, compared to the shortcut offered by P107 has current or former member (is current or former member of). The property P144.1 kind of member can be used to specify the type of membership or the role the member has in the group. Examples of the inverse property: - The election of Sir Isaac Newton as Member of Parliament to the Convention Parliament of 1689 (E85) joined with the Convention Parliament (E74). (Iliffe, 2013) - The inauguration of Mikhail Sergeyevich Gorbachev as Leader of the Union of Soviet Socialist Republics (USSR) in 1985 (E85) joined with the office of Leader of the Union of Soviet Socialist Republics (USSR) (E74) kind of member President (E55). (Galeotti, 1997) - The implementation of the membership treaty 1(st) January 1973 between EU and Denmark (E85) joined with EU (E74). In First Order Logic of the inverse property: - P144(x,y) ⇒ E85(x) - P144(x,y)⇒ E74(y) - P144(x,y,z) ⇒ [P144(x,y) ∧ E55(z)] - P144(x,y) ⇒ P11(x,y)
domain: E74 Group
label: P144 a accueilli le membre par @fr
label: P144 erwarb Mitglied durch @de
label: P144 获得成员 @zh
range: E85 Joining
sub property of: P11 participated in
notation: P144i

E11 Modification
type: Class
type: NamedIndividual
comment: Scope note: This class comprises instances of E7 Activity that are undertaken to create, alter or change instances of E24 Physical Human-Made Thing. This class includes the production of an item from raw materials and other so far undocumented objects. It also includes the conservation treatment of an object. Since the distinction between modification and production is not always clear, modification is regarded as the more generally applicable concept. This implies that some items may be consumed or destroyed in an instance of E11 Modification, and that others may be produced as a result of it. An event should also be documented using an instance of E81 Transformation if it results in the destruction of one or more objects and the simultaneous production of others using parts or material from the originals. In this case, the new items have separate identities. An activity undertaken on an object which was designed to alter it, but which, in fact, it did not in any seemingly significant way (such as the application of a solvent during conservation which failed to dissolve any part of the object), is still considered as an instance of E11 Modification. Typically, any such activity will leave at least forensic traces of evidence on the object. If the instance of E29 Design or Procedure utilized for the modification prescribes the use of specific materials, they should be documented using property P68 foresees use of (use foreseen by): E57 Material of E29 Design or Procedure, rather than via P126 employed (was employed in): E57 Material. Examples: - the construction of the SS Great Britain (E12) (Gregor, 1971) - the impregnation of the Vasa warship in Stockholm for preservation after 1956 (Håfors, 2010) - the transformation of the Enola Gay into a museum exhibit by the National Air and Space Museum in Washington DC between 1993 and 1995 (E12, E81) (Yakel, 2000) - the last renewal of the gold coating of the Toshogu shrine in Nikko, Japan (Cali and Dougil, 2012) In First …
label: E11 Bearbeitung @de
label: E11 Modificação @pt
label: E11 Τροποποίηση @el
label: E11 Событие Изменения @ru
label: E11 修改 @zh
subclass of: E7 Activity
subclass of: Restriction
  on property: P31 has modified
  some values from: E18 Physical Thing
notation: E11

P23 surrendered title through
type: ObjectProperty
type: NamedIndividual
comment: Quantification of the inverse property: many to many (0,n:0,n) Scope note of the inverse property: This property identifies the instance(s) of E39 Actor who relinquish legal ownership as the result of an instance of E8 Acquisition. The property will typically be used to describe a person donating or selling an object to a museum. In reality, the title is either transferred to or from someone, or both. Examples of the inverse property: - The acquisition of the Amoudruz collection by the Geneva Ethnography Museum (E8) transferred title from the Heirs of Amoudruz (E74). In First Order Logic of the inverse property: - P23(x,y) ⇒ E8(x) - P23(x,y) ⇒ E39(y) - P23(x,y) ⇒ P14(x,y)
domain: E39 Actor
label: P23 a cédé le titre de propriété à @fr
label: P23 perdeu os direitos de propriedade por meio da @pt
label: P23 trat Besitztitel ab in @de
label: P23 παρέδωσε τον τίτλο μέσω @el
label: P23 право собственности отдано через @ru
label: P23 出让所有权 @zh
range: E8 Acquisition
sub property of: P14 performed
notation: P23i

E64 End of Existence
type: Class
type: NamedIndividual
comment: Scope note: This class comprises events that end the existence of any instance of E77 Persistent Item. It may be used for temporal reasoning about things (physical items, groups of people, living beings) ceasing to exist; it serves as a hook both a terminus post quem and a terminus ante quem. In cases where substance from an instance of E77 Persistent Item continues to exist in a new form, the process would be documented as instances of E81 Transformation. Examples: - the death of Snoopy, my dog (fictitious) - the melting of the snowman (E6) - the burning of the Temple of Artemis in Ephesos by Herostratos in 356 BC (E7, E6) (Trell, 1945) In First Order Logic: - E64(x) ⇒ E5(x)
label: E64 Daseinsende @de
label: E64 Fim da Existência @pt
label: E64 Fin d’existence @fr
label: E64 Τέλος Ύπαρξης @el
label: E64 Конец Существования @ru
label: E64 结束 @zh
subclass of: E5 Event
subclass of: Restriction
  on property: P93 took out of existence
  some values from: E77 Persistent Item
notation: E64

P29 received custody through
type: ObjectProperty
type: NamedIndividual
comment: Quantification of the inverse property: many to many (0,n:0,n) Scope note of the inverse property: This property identifies the instance(s) of E39 Actor who receive custody of an instance of E18 Physical Thing in an instance of E10 Transfer of Custody. The property will typically describe Actors receiving custody of an object when it is handed over from another Actor’s care. On occasion, physical custody may be received involuntarily or illegally, e.g. through accident, unsolicited donation, or theft. In reality, custody is either transferred to someone or from someone, or both. Examples of the inverse property: - Representatives of The National Gallery (E74) received custody through the delivery of the paintings by Secure Deliveries Inc. to the National Gallery (E10). In First Order Logic of the inverse property: - P29(x,y) ⇒ E10(x) - P29(x,y) ⇒ E39(y) - P29(x,y) ⇒ P14(x,y)
domain: E39 Actor
label: P29 a reçu la garde par @fr
label: P29 erhielt Gewahrsam durch @de
label: P29 início da custódia por meio de @pt
label: P29 παρέλαβε κατοχή μέσω @el
label: P29 получил опеку через @ru
label: P29 获得监护权 @zh
range: E10 Transfer of Custody
sub property of: P14 performed
notation: P29i

E5 Event
type: Class
type: NamedIndividual
comment: Scope note: This class comprises distinct, delimited and coherent processes and interactions of a material nature, in cultural, social or physical systems, involving and affecting instances of E77 Persistent Item in a way characteristic of the kind of process. Typical examples are meetings, births, deaths, actions of decision taking, making or inventing things, but also more complex and extended ones such as conferences, elections, building of a castle, or battles. While the continuous growth of a tree lacks the limits characteristic of an event, its germination from a seed does qualify as an event. Similarly, the blowing of the wind lacks the distinctness and limits of an event, but a hurricane, flood or earthquake would qualify as an event. Mental processes are considered as events, in cases where they are connected with the material externalization of their results; for example, the creation of a poem, a performance or a change of intention that becomes obvious from subsequent actions or declarations. The effects of an instance of E5 Event may not lead to relevant permanent changes of properties or relations of the items involved in it, for example an unrecorded performance. Of course, in order to be documented, some kind of evidence for an event must exist, be it witnesses, traces or products of the event. While instances of E4 Period always require some form of coherence between its constituent phenomena, in addition, the essential constituents of instances of E5 Event should contribute to an overall effect; for example, the statements made during a meeting and the listening of the audience. Viewed at a coarse level of detail, an instance of E5 Event may appear as if it had an ‘instantaneous’ overall effect, but any process or interaction of material nature in reality have an extent in time and space. At a fine level, instances of E5 Event may be analysed into component phenomena and phases within a space and timeframe, and as such can be seen as a period, rega…
label: E5 Ereignis @de
label: E5 Evento @pt
label: E5 Évènement @fr
label: E5 Συμβάν @el
label: E5 Событие @ru
label: E5 事件 @zh
subclass of: E4 Period
subclass of: Restriction
  on property: P12 occurred in the presence of
  some values from: E77 Persistent Item
notation: E5

P59 has section
type: ObjectProperty
type: NamedIndividual
comment: Quantification: many to many (0,n:0,n) Scope note: This property links an area, i.e., an instance of E53 Place to the instance of E18 Physical Thing upon which it is found. This area may either be identified by a name, or by a geometry in terms of a coordinate system adapted to the shape of the respective instance of E18 Physical Thing. Typically, names identifying sections of physical objects are composed of the name of a kind of part and the name of the object itself, such as “The poop deck of H.M.S. Victory”, which is composed of “poop deck” and “H.M.S. Victory”. Examples: - HMS Victory (E22) has section HMS Victory section B347.6 (E53). (Goodwin, 2015) In First Order Logic: - P59(x,y) ⇒ E18(x) - P59(x,y) ⇒ E53(y)
domain: E18 Physical Thing
label: P59 a pour section @fr
label: P59 hat Bereich @de
label: P59 tem seção @pt
label: P59 έχει τομέα @el
label: P59 имеет район @ru
label: P59 有区域 @zh
range: E53 Place
sub property of: P157 provides reference space for
inverse of: P59 is located on or within
notation: P59

P135 created type
type: ObjectProperty
type: NamedIndividual
comment: Quantification: one to many, necessary (1,n:0,1) Scope note: This property identifies the instance of E55 Type, which is created in an instance of E83 Type Creation activity. Examples: - The description of a new ribbon worm species by Bürger (E83) created type ‘Lineus kennelii’ (E55). (Bürger, 1892) In First Order Logic: - P135(x,y) ⇒ E83(x) - P135(x,y) ⇒ E55(y) - P135(x,y) ⇒ P94(x,y)
domain: E83 Type Creation
label: P135 a créé le type @fr
label: P135 criou tipo @pt
label: P135 erschuf Typus @de
label: P135 δημιούργησε τύπο @el
label: P135 создал тип @ru
label: P135 创建类型 @zh
range: E55 Type
sub property of: P94 has created
inverse of: P135 was created by
notation: P135

P170 time is defined by
type: DatatypeProperty
type: NamedIndividual
comment: Quantification of the inverse property: many to one (0,1:0,n) Scope note of the inverse property: This property associates an instance of E61 Time Primitive with the instance of E52 Time-Span that constitutes the interpretation of the terms of the time primitive as an extent in absolute, real time. The quantification allows several instances of E61 Time Primitive that are each expressed in different syntactic forms, to define the same instance of E52 Time-Span. Examples of the inverse property: - “1800/1/1 0:00:00 – 1899/31/12 23:59:59” (E61) defines time the 19(th) century (E52). - “1968/1/1 – 2018/1/1” (E61) defines time 1968/1/1 – 2018/1/1 (E52). [an arbitrary time-span during which the Saint Titus reliquary was present in the Saint Titus Church in Heraklion, Crete] In First Order Logic of the inverse property: - P170(x,y) ⇒ E61(x) - P170(x,y) ⇒ E52(y) - P170(x, y) ⇒ P81i(x, y) ∧ P82i(x, y)
domain: E52 Time-Span
label: P170 temps défini par @fr
notation: P170i

P39 measured
type: ObjectProperty
type: NamedIndividual
comment: Quantification: many to one, necessary (1,1:0,n) Scope note: This property associates an instance of E16 Measurement with the instance of E18 Physical Thing upon which it acted. The instance of E16 Measurement is specific to the measured object. An instance of E18 Physical Thing may be measured more than once with different results, constituting different instances of E16 Measurement. Examples: - The measurement of the height of silver cup 232 on 31(st) August 1997 (E16) measured silver cup 232 (E22). (fictitious) - The carbon 14 dating of the “Schoeninger Speer II” in 1996 (E16) measured the “Schoeninger Speer II” (E22). [The carbon 14 dating of an approximately 400.000 year old complete Old Palaeolithic wooden spear found in Schoeningen, Niedersachsen, Germany, in 1995. See also, E16 Measurement.] (Kouwenhoven, 1997) In First Order Logic: - P39(x,y) ⇒ E16(x) - P39(x,y) ⇒ E18(y) - P39(x,y) ⇒ P140(x,y)
domain: E16 Measurement
label: P39 a mesuré @fr
label: P39 mediu @pt
label: P39 vermaß @de
label: P39 μέτρησε @el
label: P39 измерил @ru
label: P39 测量了 @zh
range: E18 Physical Thing
sub property of: P140 assigned attribute to
inverse of: P39 was measured by
notation: P39

P20 had specific purpose
type: ObjectProperty
type: NamedIndividual
comment: Quantification: many to many (0,n:0,n) Scope note: This property describes the relationship between a preparatory activity, an instance of E7 Activity and the instance of E5 Event that it is intended as a preparation for. This includes activities, orders and other organisational actions, taken in preparation for other activities or events. P20 had specific purpose (was purpose of) implies that the activity succeeded in achieving its aim. If it does not succeed, such as the setting of a trap that did not catch anything, the unrealized intention should be documented using P21 had general purpose (was purpose of): E55 Type and/or P33 used specific technique (was used by): E29 Design or Procedure. Examples: - Van Eyck’s pigment grinding in 1432 (E7) had specific purpose the painting of the Ghent altar piece (E12). (Borchert, 2008) In First Order Logic: - P20(x,y) ⇒ E7(x) - P20(x,y) ⇒ E5(y)
domain: E7 Activity
label: P20 a eu pour finalité spécifique @fr
label: P20 hatte den bestimmten Zweck @de
label: P20 tinha propósito específico @pt
label: P20 είχε συγκεκριμένο σκοπό @el
label: P20 имел конкретную цель @ru
label: P20 有特定目的 @zh
range: E5 Event
inverse of: P20 was purpose of
notation: P20

E58 Measurement Unit
type: Class
type: NamedIndividual
comment: Scope note: This class is a specialization of E55 Type and comprises the types of measurement units: feet, inches, centimetres, litres, lumens, etc. This type is used categorically in the model without reference to instances of it, i.e. the model does not foresee the description of instances of instances of E58 Measurement Unit, e.g. “instances of cm”. Système International (SI) units or internationally recognized non-SI terms should be used whenever possible, such as those defined by ISO80000:2009. Archaic Measurement Units used in historical records should be preserved. Examples: - cm [centimetre] - km [kilometre] - m [metre] - m/s [metres per second] (Hau et al., 1999) - A [ampere] - GRD [Greek Drachma] (E98) (Daniel, 2014) - C [degrees centigrade] (Beckman, 1998) In First Order Logic: - E58(x) ⇒ E55(x)
label: E58 Maßeinheit @de
label: E58 Unidade de Medida @pt
label: E58 Unité de mesure @fr
label: E58 Μονάδα Μέτρησης @el
label: E58 Единица Измерения @ru
label: E58 测量单位 @zh
subclass of: E55 Type
subclass of: Restriction
  on property: P91 is unit of
  some values from: E54 Dimension
notation: E58

P33 was used by
type: ObjectProperty
type: NamedIndividual
comment: Quantification of the inverse property: many to many (0,n:0,n) Scope note of the inverse property: This property identifies a specific instance of E29 Design or Procedure in order to carry out an instance of E7 Activity or parts of it. The property differs from P32 used general technique (was technique of) in that P33 refers to an instance of E29 Design or Procedure, which is a concrete information object in its own right rather than simply being a term or a method known by tradition. Typical examples would include intervention plans for conservation or the construction plans of a building. Examples of the inverse property: - The ornamentation of silver cup 232 (E11) used specific technique ‘Instructions for golden chase work by A N Other’ (E29). (fictitious) - The rebuilding of the German Reichstag in Berlin (E11) used specific technique Architectural plans by Foster and Partners (E29). (Foster, 2000) In First Order Logic of the inverse property: - P33(x,y) ⇒ E7(x) - P33(x,y) ⇒ E29(y) - P33(x,y) ⇒ P16(x,y)
domain: E29 Design or Procedure
label: P33 a été la technique spécifique mise en œuvre dans @fr
label: P33 foi usada por @pt
label: P33 wurde benutzt von @de
label: P33 χρησιμοποιήθηκε για @el
label: P33 был использован посредством @ru
label: P33 被使用 @zh
range: E7 Activity
sub property of: P16 was used for
notation: P33i

P147 was curated by
type: ObjectProperty
type: NamedIndividual
comment: Quantification of the inverse property: many to many, necessary (1,n:0,n) Scope note of the inverse property: This property associates an instance of E87 Curation Activity with the instance of E78 Curated Holding with that is subject of that curation activity following some implicit or explicit curation plan. Examples of the inverse property: - The curation activity of the Benaki Museum for the Toys, Games and Childhood Collection (E87) curated The Toys, Games and Childhood Collection of the Benaki Museum (E78). [The curation activity included the acquisition of dolls and games of urban and folk manufacture dating from the 17(th) to the 20(th) century, from England, France and Germany for the Toys, Games and Childhood Collection of the museum.] (Benaki Museum, 2016) - The curation activity for the permanent Numismatic Collection of the Historical Museum of Crete, Heraklion, Crete from 2005 up to the present (E87) curated the Numismatic Collection (E78). (Historical Museum of Crete, 2005) - The curation activity of Mikael Heggelund Foslie (E87) curated the Mikael Heggelund Foslie’s coralline red algae Herbarium (E78). (Woelkerling et al., 2005) In First Order Logic of the inverse property: - P147(x,y) ⇒ E87(x) - P147(x,y) ⇒ E78(y)
domain: E78 Curated Holding
label: P147 a été géré par @fr
label: P147 wurde kuratorisch betreut durch @de
label: P147 被管理 @zh
range: E87 Curation Activity
notation: P147i

P38 was deassigned by
type: ObjectProperty
type: NamedIndividual
comment: Quantification of the inverse property: many to many (0,n:0,n) Scope note of the inverse property: This property records the identifier that was deassigned from an instance of E1 CRM Entity. De-assignment of an identifier may be necessary when an item is taken out of an inventory, a new numbering system is introduced or items are merged or split up. The same identifier may be deassigned on more than one occasion. Examples of the inverse property: - The identifier assignment on 31(st) July 2001 of the silver cup OXCMS:2001.1.32 (E15) deassigned “232” (E42). (fictitious) In First Order Logic of the inverse property: - P38(x,y) ⇒ E15(x) - P38(x,y) ⇒ E42(y) - P38(x,y) ⇒ P141(x,y)
domain: E42 Identifier
label: P38 a été retiré par @fr
label: P38 foi retirada a atribuição por @pt
label: P38 wurde aufgehoben durch @de
label: P38 ακυρώθηκε από @el
label: P38 был отменен посредством @ru
label: P38 被取消 @zh
range: E15 Identifier Assignment
sub property of: P141 was assigned by
notation: P38i

P52 has current owner
type: ObjectProperty
type: NamedIndividual
comment: Quantification: many to many (0,n:0,n) Scope note: This property identifies the instance of E21 Person or E74 Group that was the owner of an instance of E18 Physical Thing at the time of validity of the record or database containing the statement that uses this property. This property is a shortcut for the more detailed path from E18 Physical Thing through, P24i changed ownership through, E8 Acquisition, P22 transferred title to to E39 Actor, if and only if this acquisition event is the most recent. Examples: - The paintings from the Iveagh Bequest (E78) has current owner Historic England (E74). [This is still valid 2021 CE. The important collection of Old Master and British portraits was bequeathed to Kenwood by Edward Cecil Guinness, 1(st) Earl of Iveagh, in 1927.] (Iveagh Bequest, 1975; Bryant, 1990) In First Order Logic: - P52(x,y) ⇒ E18(x) - P52(x,y) ⇒ E39(y) - P52(x,y) ⇒ P51(x,y) - P52(x,y) ⇒ P105(x,y) - P52(x,y) ⇐ (∃z) [[E8(z) ˄ P24i(x,z) ˄ P22(z,y) ] - ˄ ¬ (∃w) [E8(w) ˄ P24i(x,w) ˄ P23(w,y)˄ P182(z,w)]]
domain: E18 Physical Thing
label: P52 a pour propriétaire actuel @fr
label: P52 hat derzeitigen Besitzer @de
label: P52 é propriedade de @pt
label: P52 έχει ιδιοκτήτη @el
label: P52 имеет текущего владельца @ru
label: P52 有当前所有者 @zh
range: E39 Actor
sub property of: P105 right held by
sub property of: P51 has former or current owner
inverse of: P52 is current owner of
notation: P52

E73 Information Object
type: Class
type: NamedIndividual
comment: Scope note: This class comprises identifiable immaterial items, such as poems, jokes, data sets, images, texts, multimedia objects, procedural prescriptions, computer program code, algorithm or mathematical formulae, that have an objectively recognizable structure and are documented as single units. The encoding structure known as a “named graph” also falls under this class, so that each “named graph” is an instance of E73 Information Object. An instance of E73 Information Object does not depend on a specific physical carrier, which can include human memory, and it can exist on one or more carriers simultaneously. Instances of E73 Information Object of a linguistic nature should be declared as instances of the E33 Linguistic Object subclass. Instances of E73 Information Object of a documentary nature should be declared as instances of the E31 Document subclass. Conceptual items such as types and classes are not instances of E73 Information Object, nor are ideas without a reproducible expression. Examples: - image BM000038850.JPG from the Clayton Herbarium in London (E31) (Natural History Museum, 2021) - E. A. Poe's “The Raven” (Poe, 1869) - the movie “The Seven Samurai” by Akira Kurosawa (Mellen, 2002) - the text of Huray describing the Maxwell Equations (Huray, 2010) - the Getty AAT as published as Linked Open Data, accessed 1/10/2014 In First Order Logic: - E73(x) ⇒ E89(x) - E73(x) ⇒ E90(x)
label: E73 Informationsgegenstand @de
label: E73 Objet informationnel @fr
label: E73 Objeto de Informação @pt
label: E73 Πληροφοριακό Αντικείμενο @el
label: E73 Информационный Объект @ru
label: E73 信息对象 @zh
subclass of: E89 Propositional Object
subclass of: E90 Symbolic Object
notation: E73

Erlangen CRM / OWL
type: Ontology
comment: Changelog: https://github.com/erlangen-crm/ecrm/commits/master
comment: Erlangen CRM / OWL - An OWL DL 1.0 implementation of the CIDOC Conceptual Reference Model, based on: Nick Crofts, Martin Doerr, Tony Gill, Stephen Stead, Matthew Stiff (eds.): Definition of the CIDOC Conceptual Reference Model (http://cidoc-crm.org/). This implementation has been originally created by Bernhard Schiemann, Martin Oischinger and Günther Görz at the Friedrich-Alexander-University of Erlangen-Nuremberg, Department of Computer Science, Chair of Computer Science 8 (Artificial Intelligence) in cooperation with the Department of Museum Informatics of the Germanisches Nationalmuseum Nuremberg and the Department of Biodiversity Informatics of the Zoologisches Forschungsmuseum Alexander Koenig Bonn. The Erlangen CRM / OWL implementation of the CIDOC Conceptual Reference Model is licensed under a Creative Commons Attribution-ShareAlike 3.0 Unported License.
imports: crmarchaeo
imports: crmsci
version info: ECRM 240307 / CIDOC-CRM 7.1.3

P34 was assessed by
type: ObjectProperty
type: NamedIndividual
comment: Quantification of the inverse property: many to many, necessary (1,n:0,n) Scope note of the inverse property: This property identifies the instance of E18 Physical Thing that was assessed during an instance of E14 Condition Assessment. Conditions may be assessed either by direct observation or using recorded evidence. In the latter case the instance of E18 Physical Thing does not need to be present or extant at the time of assessment. Examples of the inverse property: - The condition assessment of the silver collection in 1997 (E14) concerned silver cup 232 (E22). (fictitious) - The condition assessment of the cover of MS Sinai Greek 418 (E14) concerned the cover of MS Sinai Greek 418 (E22). (Honey and Pickwoad, 2010) - The condition assessment of the endband cores of MS Sinai Greek 418 (E14) concerned the endband cores of MS Sinai Greek 418 (E22). (Honey and Pickwoad, 2010) In First Order Logic of the inverse property: - P34(x,y) ⇒ E14(x) - P34(x,y) ⇒ E18(y) - P34(x,y) ⇒ P140(x,y)
domain: E18 Physical Thing
label: P34 a été évalué par @fr
label: P34 foi avaliada por @pt
label: P34 wurde beurteilt durch @de
label: P34 εκτιμήθηκε από @el
label: P34 был оценен посредством @ru
label: P34 被评估 @zh
range: E14 Condition Assessment
sub property of: P140 was attributed by
notation: P34i

E77 Persistent Item
type: Class
type: NamedIndividual
comment: Scope note: This class comprises items that have persistent characteristics of structural nature substantially related to their identity and their integrity, sometimes known as “endurants” in philosophy. Persistent Items may be physical entities, such as people, animals or things, conceptual entities such as ideas, concepts, products of the imagination or even names. Instances of E77 Persistent Item may be present or be part of interactions in different periods or events. They can repeatedly be recognized at disparate occasions during their existence by characteristics of structural nature. The respective characteristics need not be exactly the same during all the existence of an instance of E77 Persistent Item. Often, they undergo gradual change, still bearing some similarities with that of previous times, or disappear completely and new emerge. For instance, a person, from the time of being born on, will gradually change all its features and acquire new ones, such as a scar. Even the DNA in different body cells will develop defects and mutations. Nevertheless, relevant characteristics used should be sufficiently similar to recognize the instance for some substantial period of time. The more specific criteria that determine the identity of instances of subclasses of E77 Persistent Item may vary considerably and are described or referred to in the respective scope notes. The decision about which exact criteria to use depends on whether the observable behaviour of the respective part of reality such confined conforms to the reasoning the user is interested in. For example, a building can be regarded as no longer existing if it is dismantled and the materials reused in a different configuration. On the other hand, human beings go through radical and profound changes during their life-span, affecting both material composition and form, yet preserve their identity by other criteria, such as being bodily separated from other persons. Similarly, inanimate objects may be s…
label: E77 Entidade Persistente @pt
label: E77 Entité persistante @fr
label: E77 Seiendes @de
label: E77 Ον @el
label: E77 Постоянная Сущность @ru
label: E77 持久项 @zh
subclass of: E1 CRM Entity
notation: E77

E27 Site
type: Class
type: NamedIndividual
comment: Scope note: This class comprises pieces of land or sea floor. In contrast to the purely geometric notion of E53 Place, this class describes constellations of matter on the surface of the Earth or other celestial body, which can be represented by photographs, paintings, and maps. Instances of E27 Site are composed of relatively immobile material items and features in a particular configuration at a particular location. Examples: - the Amazon river basin (Hegen, 1966) - Knossos (Evans, 1921) - the Apollo 11 landing site (Siegler and Smrekar, 2014) - Heathrow Airport (Wicks, 2014) - the submerged harbour of the Minoan settlement of Gournia, Crete (Watrous, 2012) - the island of Crete In First Order Logic: - E27(x) ⇒ E26(x)
label: E27 Gelände @de
label: E27 Lugar @pt
label: E27 Φυσικός Χώρος @el
label: E27 Участок @ru
label: E27 场地 @zh
subclass of: E26 Physical Feature
notation: E27

P125 was type of object used in
type: ObjectProperty
type: NamedIndividual
comment: Quantification of the inverse property: many to many (0,n:0,n) Scope note of the inverse property: This property associates an instance of E7 Activity to an instance of E55 Type, which classifies an instance of E70 Thing used in an instance of E7 Activity, when the specific instance is either unknown or not of interest, such as use of “a hammer”. This property is a shortcut of the more fully developed path from E7 Activity through P16 used specific object, E70 Thing, P2 has type, to E55 Type. Examples of the inverse property: - The English archers’ activity in the Battle of Agincourt (E7) used object of type long bow (E55). (Curry, 2015) In First Order Logic of the inverse property: - P125(x,y) ⇒ E7(x) - P125(x,y) ⇒ E55(y) - P125(x,y) ⇔ (∃z) [E70(z) ∧ P16(x,z) ∧ P2(z,y)]
domain: E55 Type
label: P125 Objekt des Typus ... wurde benutzt in @de
label: P125 a été le type d’objet employé pour @fr
label: P125 foi tipo do objeto usado em @pt
label: P125 ήταν o τύπος αντικείμενου που χρησιμοποιήθηκε σε @el
label: P125 был типом объекта использованного в @ru
label: P125 是使用的对象类型 @zh
range: E7 Activity
notation: P125i

P35 has identified
type: ObjectProperty
type: NamedIndividual
comment: Quantification: many to many, necessary (1,n:0,n) Scope note: This property identifies the instance of E3 Condition State that was observed in an instance of E14 Condition Assessment activity. Examples: - The condition assessment of silver cup 232 in 1997 (E14) has identified oxidation traces were present in 1997 (E3). [which has type (P2) with oxidation traces (E55)] (fictitious) - The condition assessment of the cover of MS Sinai Greek 418 (E13) has identified the condition state in November 2003 (E3). [which has type fine (E55)] (Honey and Pickwoad, 2010) - The condition assessment of the endband cores of MS Sinai Greek 418 (E14) has identified the condition state in November 2003 (E3). [which has type broken (E55)] (Honey and Pickwoad, 2010) In First Order Logic: - P35(x,y) ⇒E14(x) - P35(x,y) ⇒ E3(y) - P35(x,y) ⇒ P141(x,y)
domain: E14 Condition Assessment
label: P35 a identifié @fr
label: P35 hat identifiziert @de
label: P35 identificou @pt
label: P35 έχει διαπιστώσει @el
label: P35 идентифицировал @ru
label: P35 有标识 @zh
range: E3 Condition State
sub property of: P141 assigned
inverse of: P35 was identified by
notation: P35

E31 Document
type: Class
type: NamedIndividual
comment: Scope note: This class comprises identifiable immaterial items that make propositions about reality. These propositions may be expressed in text, graphics, images, audiograms, videograms, or by other similar means. Documentation databases are regarded as instances of E31 Document. This class should not be confused with the concept “document” in Information Technology, which is compatible with E73 Information Object. Examples: - the Encyclopaedia Britannica (E32) (Kogan, 1958) - the image content of the photo of the Allied Leaders at Yalta published by UPI, 1945 (E36) - Domesday Book [a manuscript record of the "Great Survey" of much of England and parts of Wales completed in 1086 by order of King William the Conqueror] (Hallam 1986) In First Order Logic: - E31(x) ⇒ E73(x)
label: E31 Documento @pt
label: E31 Dokument @de
label: E31 Τεκμήριο @el
label: E31 Документ @ru
label: E31 文献 @zh
subclass of: E73 Information Object
subclass of: Restriction
  on property: P70 documents
  some values from: E1 CRM Entity
notation: E31

E39 Actor
type: Class
type: NamedIndividual
comment: Scope note: This class comprises people, either individually or in groups, who have the potential to perform intentional actions of kinds for which they can be held responsible. Examples: - London and Continental Railways (E74) - the Governor of the Bank of England in 1975 (E21) - Sir Ian McKellen (E21) (Gibson, 1986) In First Order Logic: - E39(x) ⇒ E77(x)
label: E39 Actant @fr
label: E39 Agente @pt
label: E39 Akteur @de
label: E39 Δράστης @el
label: E39 Агент @ru
label: E39 参与者 @zh
subclass of: E77 Persistent Item
notation: E39

P76 provides access to
type: ObjectProperty
type: NamedIndividual
comment: Quantification of the inverse property: many to many (0,n:0,n) Scope note of the inverse property: This property associates an instance of E39 Actor to an instance of E41 Appellation which a communication service uses to direct communications to this actor, such as an e-mail address, fax number, or postal address. Examples of the inverse property: - The Research Libraries Group, Inc. (RLG) (E74) has contact point “bl.ric@rlg.org” (E41) In First Order Logic of the inverse property: - P76(x,y) ⇒ E39(x) - P76(x,y) ⇒ E41(y)
domain: E41 Appellation
label: P76 bietet Zugang zu @de
label: P76 permet de contacter @fr
label: P76 é ponto de contado de @pt
label: P76 παρέχει πρόσβαση σε @el
label: P76 предоставляет доступ к @ru
label: P76 提供访问 @zh
range: E39 Actor
notation: P76i

P106 is composed of
type: ObjectProperty
type: TransitiveProperty
type: NamedIndividual
comment: Quantification: many to many (0,n:0,n) Scope note: This property associates an instance of E90 Symbolic Object with a part of it that is by itself an instance of E90 Symbolic Object, such as fragments of texts or clippings from an image. This property is transitive asymmetric. Examples: - This Scope note of property P106 (E33) is composed of ‘fragments of texts’ (E33). - ‘recognizable’ (E90) is composed of ‘ecognizabl’ (E90). In First Order Logic: - P106(x,y) ⇒ E90(x) - P106(x,y) ⇒ E90(y) - [P106(x,y) ∧ P106(y,z)] ⇒ P106(x,z) - P106(x,y) ⇒ ¬P106(y,x)
domain: E90 Symbolic Object
label: P106 est composé de @fr
label: P106 ist zusammengesetzt aus @de
label: P106 é composto de @pt
label: P106 αποτελείται από @el
label: P106 составлен из @ru
label: P106 组成成分是 @zh
range: E90 Symbolic Object
inverse of: P106 forms part of
notation: P106

P25 moved
type: ObjectProperty
type: NamedIndividual
comment: Quantification: many to many, necessary (1,n:0,n) Scope note: This property identifies an instance of E19 Physical Object that was moved by an instance of E9 Move. A move must concern at least one object. The property implies the object’s passive participation. For example, Monet’s painting “Impression sunrise” was moved for the first Impressionist exhibition in 1874. Examples: - Monet´s “Impression sunrise” (E22) moved by preparations for the First Impressionist Exhibition (E9). In First Order Logic: - P25(x,y) ⇒ E9(x) - P25(x,y) ⇒ E19(y) - P25(x,y) ⇒ P12(x,y)
domain: E9 Move
label: P25 a déplacé @fr
label: P25 bewegte @de
label: P25 locomoveu @pt
label: P25 μετεκίνησε @el
label: P25 переместил @ru
label: P25 移动 @zh
range: E19 Physical Object
sub property of: P12 occurred in the presence of
inverse of: P25 moved by
notation: P25

P195 was a presence of
type: ObjectProperty
type: NamedIndividual
comment: Quantification: many to one, necessary (1,1:0,n) Scope note: This property associates an instance of E93 Presence with the instance of E18 Physical Thing of which it represents a temporal restriction (i.e. a time-slice) of the thing’s trajectory through spacetime. In other words, it describes where the instance of E18 Physical Thing was or moved around within a given time-span. Instantiating this property constitutes a necessary part of the identity of the respective instance of E93 Presence. This property is a shortcut of the fully developed path from E18 Physical Thing through P196 defines, E92 Spacetime Volume, P166 was a presence of (had presence) to E93 Presence. Examples: - Johann Joachim Winckelmann’s whereabouts in December 1755 (E93) was a presence of Johann Joachim Winckelmann (E21). (Wiencke, 1998) - Johann Joachim Winckelmann’s whereabouts from 19(th) November 1755 until 9(th) April 1768 (E93) was a presence of Johann Joachim Winckelmann (E21). (Wiencke, 1998) In First Order Logic: - P195(x,y) ⇒ E93(x) - P195(x,y) ⇒ E18(y) - P195(x,y) ⇔ (∃z)[E92(z) ∧ P166(z,x) ∧ P196i(z,y)]
domain: E93 Presence
label: P195 a été une présence de @fr
range: E18 Physical Thing
inverse of: P195 had presence
notation: P195

E96 Purchase
type: Class
type: NamedIndividual
comment: Scope note: This class comprises transfers of legal ownership from one or more instances of E39 Actor to one or more different instances of E39 Actor, where the transferring party is completely compensated by the payment of a monetary amount. In more detail, a purchase agreement establishes a fixed monetary obligation at its initialization on the receiving party, to the giving party. An instance of E96 Purchase begins with the contract or equivalent agreement and ends with the fulfilment of all contractual obligations. In the case that the activity is abandoned before both parties have fulfilled these obligations, the activity is not regarded as an instance of E96 Purchase. This class is a very specific case of the much more complex social business practices of exchange of goods and the creation and satisfaction of related social obligations. Purchase activities which define individual sales prices per object can be modelled by instantiating E96 Purchase for each object individually and as part of an overall instance of E96 Purchase transaction. Examples: - the purchase of 10 okka of nails by the captain A. Syrmas on 18(th) September 1895 in Thessaloniki (Syrmas, 1896) In First Order Logic: - E96(x) ⇒ E8(x)
label: E96 Achat @fr
subclass of: E8 Acquisition
notation: E96

P96 gave birth
type: ObjectProperty
type: NamedIndividual
comment: Quantification of the inverse property: many to one, necessary (1,1:0,n) Scope note of the inverse property: This property links an instance of E67 Birth to an instance of E21 Person in the role of birth-giving mother. Note that biological fathers are not necessarily participants in the Birth (see P97 from father (was father for)). The instance of E21 Person being born is linked to the instance of E67 Birth with the property P98 brought into life (was born). This is not intended for use with general natural history material, only people. There is no explicit method for modelling conception and gestation except by using extensions. Examples of the inverse property: - The birth of Queen Elizabeth II (E67) by mother Her Majesty Queen Elizabeth The Queen Mother (E21). (Parker, 2002) In First Order Logic of the inverse property: - P96(x,y) ⇒ E67(x) - P96(x,y) ⇒ E21(y) - P96(x,y) ⇒ P11(x,y)
domain: E21 Person
label: P96 a donné naissance à @fr
label: P96 deu nascimento @pt
label: P96 gebar @de
label: P96 ήταν μητέρα του/της @el
label: P96 дал рождение @ru
label: P96 生育 @zh
range: E67 Birth
sub property of: P11 participated in
notation: P96i

P55 currently holds
type: ObjectProperty
type: NamedIndividual
comment: Quantification of the inverse property: many to many (0,n:0,n) Scope note of the inverse property: This property records the location of an instance of E19 Physical Object at the time of validity of the record or database containing the statement that uses this property. This property is a specialisation of P53 has former or current location (is former or current location of). It indicates that the instance of E53 Place associated with the instance of E19 Physical Object is the current location of the object. The property does not allow any indication of how long the object has been at the current location. This property is a shortcut. A more detailed representation can make use of the fully developed (i.e., indirect) path from E19 Physical Object, through, P25i moved by, E9 Move, P26 moved to to E53 Place if and only if this Move is the most recent. Examples of the inverse property: - Silver cup 232 (E22) has current location Display Cabinet 23, Room 4, British Museum (E53). (fictitious) In First Order Logic of the inverse property: - P55(x,y) ⇒ E19(x) - P55(x,y) ⇒ E53(y) - P55(x,y) ⇒ P53(x,y) - P55(x,y) ⇐ (∃z) [ [E9(z) ˄ P25i(x,z) ˄ P26(z,y)] - ˄ ¬​ (∃w) [E9(w) ˄ P25i(x,w) ˄ P27(w,y)˄ P182(z,w)]]​
domain: E53 Place
label: P55 est actuellement la localisation de @fr
label: P55 hält derzeitig @de
label: P55 é localização atual de @pt
label: P55 είναι θέση του @el
label: P55 в данный момент содержит @ru
label: P55 当前拥有 @zh
range: E19 Physical Object
sub property of: P53 is former or current location of
notation: P55i

P82 at some time within
type: DatatypeProperty
type: NamedIndividual
comment: Quantification: many to many, necessary (1,n:0,n) Scope note: This property describes the maximum period of time within which an E52 Time-Span falls. Since Time-Spans may not have precisely known temporal extents, the CIDOC CRM supports statements about the minimum and maximum temporal extents of Time-Spans. This property allows a Time-Span’s maximum temporal extent (i.e. its outer boundary) to be assigned an E61 Time Primitive value. Time Primitives are treated by the CIDOC CRM as application or system specific date intervals, and are not further analysed. If different sources of evidence justify different maximum extents without contradicting each other, the resulting intersection of all these extents will be the best estimate. This should be taken into account for information integration. Examples: - The time-span of the development of the CIDOC CRM (E52) at some time within “1992-infinity” (E61). (Doerr, 2003) - The Time-Span of the Battle in the Teutoburg Forest (E52) at some time within “September 9 CE” (E61). (Andrews & Kesteven, 1977) - The time-Span of the death of Tut Ankh Amun (E52) at some time within “December 1324 BC to February 1323 BC” (E61). (Murdoch, 2003) - The time-span of the First Intermediate Period of Ancient Egypt (7(th) to 10(th) dynasty) (E52) at some time within “2475BC - 2125BC” (E61). (Reid, 1993) In First Order Logic: - P82(x,y) ⇒ E52(x) - P82(x,y) ⇒ E61(y)
domain: E52 Time-Span
label: P82 a eu lieu durant @fr
label: P82 abrange no máximo @pt
label: P82 irgendwann innerhalb von @de
label: P82 κάποτε εντός @el
label: P82 некоторое время в течение @ru
label: P82 最长范围是 @zh
notation: P82

P72 is language of
type: ObjectProperty
type: NamedIndividual
comment: Quantification of the inverse property: many to many, necessary (1,n:0,n) Scope note of the inverse property: This property associates an instance(s) of E33 Linguistic Object with an instance of E56 Language in which it is, at least partially, expressed. Linguistic Objects are composed in one or more human languages. This property allows these languages to be documented. Examples of the inverse property: - The United States Declaration of Independence (E33) has language 18(th) Century English (E56). (Perley, 2017) In First Order Logic of the inverse property: - P72(x,y) ⇒ E33(x) - P72(x,y) ⇒ E56(y)
domain: E56 Language
label: P72 est la langue de @fr
label: P72 ist Sprache von @de
label: P72 é a língua de @pt
label: P72 είναι γλώσσα του/της @el
label: P72 является языком для @ru
label: P72 是语种 @zh
range: E33 Linguistic Object
notation: P72i

P50 is current keeper of
type: ObjectProperty
type: NamedIndividual
comment: Quantification of the inverse property: many to many (0,n:0,n) Scope note of the inverse property: This property identifies the instance of E39 Actor that had custody of an instance of E18 Physical Thing at the time of validity of the record or database containing the statement that uses this property. This property is a shortcut for the more detailed path from E18 Physical Thing through, P30i custody transferred through, E10 Transfer of Custody, P29 custody received by to E39 Actor, if and only if the custody has not been surrendered by the receiving actor at any later time Examples of the inverse property: - The paintings from The Iveagh Bequest (E78) has current keeper The National Gallery (E74) (Iveagh Bequest, 1975) In First Order Logic of the inverse property: - P50(x,y) ⇒ E18(x) - P50(x,y) ⇒ E39(y) - P50(x,y) ⇒ P49(x,y) - P50(x,y) ⇐ (∃z) [[E10(z) ˄ P30i(x,z) ˄ P29(z,y) ] - ˄ ¬ (∃w) [E10(w) ˄ P30i(x,w) ˄ P28(w,y)˄ P182(z,w)]]
domain: E39 Actor
label: P50 est l’actant détenteur actuel @fr
label: P50 ist derzeitiger Betreuer von @de
label: P50 é guardador de @pt
label: P50 κατέχει @el
label: P50 является текущим смотрителем для @ru
label: P50 是当前保管者 @zh
range: E18 Physical Thing
sub property of: P49 is former or current keeper of
notation: P50i

P129 is subject of
type: ObjectProperty
type: NamedIndividual
comment: Quantification of the inverse property: many to many (0,n:0,n) Scope note of the inverse property: This property documents that an instance of E89 Propositional Object has as subject an instance of E1 CRM Entity. This differs from P67 refers to (is referred to by), which refers to an instance of E1 CRM Entity, in that it describes the primary subject or subjects of an instance of E89 Propositional Object. Examples of the inverse property: - The text entitled ‘Reach for the sky’ (E33) is about Douglas Bader (E21). (Brickhill, 2001) In First Order Logic of the inverse property: - P129(x,y) ⇒ E89(x) - P129(x,y) ⇒ E1(y) - P129(x,y) ⇒ P67(x,y)
domain: E1 CRM Entity
label: P129 est le sujet de @fr
label: P129 wird behandelt in @de
label: P129 é assunto de @pt
label: P129 είναι θέμα του/της @el
label: P129 является предметом для @ru
label: P129 是主题 @zh
range: E89 Propositional Object
sub property of: P67 is referred to by
notation: P129i

P165 incorporates
type: ObjectProperty
type: NamedIndividual
comment: Quantification: many to many (0,n:0,n) Scope note: This property associates an instance of E73 Information Object with an instance of E90 Symbolic Object (or any of its subclasses) that was included in it. This property makes it possible to recognise the autonomous status of the incorporated signs, which were created in a distinct context, and can be incorporated in many instances of E73 Information Object, and to highlight the difference between structural and accidental whole-part relationships between conceptual entities. It accounts for many cultural facts that are quite frequent and significant: the inclusion of a poem in an anthology, the re-use of an operatic aria in a new opera, the use of a reproduction of a painting for a book cover or a CD booklet, the integration of textual quotations, the presence of lyrics in a song that sets those lyrics to music, the presence of the text of a play in a movie based on that play, etc. In particular, this property allows for modelling relationships of different levels of symbolic specificity, such as the natural language words making up a particular text, the characters making up the words and punctuation, the choice of fonts and page layout for the characters. When restricted to information objects, that is, seen as a property with E73 Information Object as domain and range the property is transitive. A digital photograph of a manuscript page incorporates the text of a manuscript page, if the respective text is defined as a sequence of symbols of a particular type, such as Latin characters, and the resolution and quality of the digital image is sufficient to resolve these symbols so they are readable on the digital image. This property is asymmetric. Examples: - The content of Charles-Moïse Briquet’s ‘Les Filigranes: dictionnaire historique des marques du papier’ (E32) incorporates the visual aspect of the watermark used around 1358-61 by some Spanish papermaker(s) and identified as ‘Briquet 4019’ (E37). (Briquet, 1985…
domain: E73 Information Object
label: P165 inclut @fr
range: E90 Symbolic Object
sub property of: P106 is composed of
inverse of: P165 is incorporated in
notation: P165

P25 moved by
type: ObjectProperty
type: NamedIndividual
comment: Quantification of the inverse property: many to many, necessary (1,n:0,n) Scope note of the inverse property: This property identifies an instance of E19 Physical Object that was moved by an instance of E9 Move. A move must concern at least one object. The property implies the object’s passive participation. For example, Monet’s painting “Impression sunrise” was moved for the first Impressionist exhibition in 1874. Examples of the inverse property: - Monet´s “Impression sunrise” (E22) moved by preparations for the First Impressionist Exhibition (E9). In First Order Logic of the inverse property: - P25(x,y) ⇒ E9(x) - P25(x,y) ⇒ E19(y) - P25(x,y) ⇒ P12(x,y)
domain: E19 Physical Object
label: P25 a été déplacé par @fr
label: P25 foi locomovido por @pt
label: P25 wurde bewegt durch @de
label: P25 μετακινήθηκε από @el
label: P25 перемещен посредством @ru
label: P25 被移动 @zh
range: E9 Move
sub property of: P12 was present at
notation: P25i

P30 custody transferred through
type: ObjectProperty
type: NamedIndividual
comment: Quantification of the inverse property: many to many, necessary (1,n:0,n) Scope note of the inverse property: This property identifies the instance(s) of E18 Physical Thing concerned in an instance of E10 Transfer of Custody. The property will typically describe the object that is handed over by an instance of E39 Actor to the custody of another instance of E39 Actor. On occasion, physical custody may be transferred involuntarily or illegally, e.g. through accident, unsolicited donation, or theft. Examples of the inverse property: - The delivery of the paintings by Secure Deliveries Inc. to the National Gallery (E10) transferred custody of paintings from The Iveagh Bequest (E19). In First Order Logic of the inverse property: - P30(x,y) ⇒ E10(x) - P30(x,y) ⇒ E18(y)
domain: E18 Physical Thing
label: P30 a été l’objet d’un transfert de garde par @fr
label: P30 custódia transferida por meio de @pt
label: P30 wechselte Gewahrsam durch @de
label: P30 άλλαξε κατοχή μέσω @el
label: P30 опека передана через @ru
label: P30 变更监护权 @zh
range: E10 Transfer of Custody
notation: P30i

P133 is spatiotemporally separated from
type: ObjectProperty
type: SymmetricProperty
type: NamedIndividual
comment: Quantification: many to many (0,n:0,n) Scope note: This symmetric property associates two instances of E92 Spacetime Volume that have no extents in common. If only the fuzzy boundaries of the instances of E92 Spacetime Volume overlap, this property cannot be determined from observation alone and therefore should not be applied. However, there may be other forms of justification that the two instances of E92 Spacetime Volume must not have any of their extents in common regardless of where and when precisely. If this property holds for two instances of E92 Spacetime Volume then it cannot be the case that P132 spatiotemporally overlaps with also holds for the same two instances. Furthermore, there are cases where neither P132 spatiotemporally overlaps with nor P133 is spatiotemporally separated from holds between two instances of E92 Spacetime Volume. This would occur where only an overlap of the fuzzy boundaries of the two instances of E92 Spacetime Volume occurs and no other evidence is available. This property is not transitive. This property is symmetric. This property is irreflexive. Examples: - The “Hallstatt” period (E4) is spatiotemporally separated from the “La Tène” era (E4). (Marion, 2004) - Kingdom of Greece (1831-1924) (E92) is spatiotemporally separated from Ottoman Empire (1299-1922) (E92). - The path of the army of Alexander the Great (335-323 B.C.) (E7) is spatiotemporally separated from the Mauryan Empire (E4). (Lane Fox, 2004) In First Order Logic: - P133(x,y) ⇒ E92(x) - P133(x,y) ⇒ E92(y) - P133(x,y) ⇒ P133(y,x) - P133(x,y) ⇒ ¬P133 (x,y) - ¬P133(x,x)
domain: E92 Spacetime Volume
label: P133 est distinct spatio-temporellement de @fr
range: E92 Spacetime Volume
notation: P133

P132 spatiotemporally overlaps with
type: ObjectProperty
type: SymmetricProperty
type: NamedIndividual
comment: Quantification: many to many (0,n:0,n) Scope note: This symmetric property associates two instances of E92 Spacetime Volume that have some of their extents in common. If only the fuzzy boundaries of the instances of E92 Spacetime Volume overlap, this property cannot be determined from observation alone and therefore should not be applied. However, there may be other forms of justification that the two instances of E92 Spacetime Volume must have some of their extents in common regardless of where and when precisely. If this property holds for two instances of E92 Spacetime Volume then it cannot be the case that P133 is spatiotemporally separated from also holds for the same two instances. Furthermore, there are cases where neither P132 spatiotemporally overlaps with nor P133 is spatiotemporally separated from holds between two instances of E92 Spacetime Volume. This would occur where only an overlap of the fuzzy boundaries of the two instances of E92 Spacetime Volume occurs and no other evidence is available. This property is not transitive. This property is symmetric. This property is reflexive. Examples: - The “Urnfield” period (E4) spatiotemporally overlaps with the “Hallstatt” period (E4). (Gimbutas, 1965) In First Order Logic: - P132(x,y) ⇒ E92(x) - P132(x,y) ⇒ E92(y) - P132(x,y) ⇒ P132(y,x) - P132(x,y) ⇒ P132 (x,y) - P132(x,x)
domain: E92 Spacetime Volume
label: P132 recoupe spatio-temporellement @fr
range: E92 Spacetime Volume
notation: P132

P127 has broader term
type: ObjectProperty
type: TransitiveProperty
type: NamedIndividual
comment: Quantification: many to many (0,n:0,n) Scope note: This property associates an instance of E55 Type with another instance of E55 Type that has a broader meaning. It allows instances of E55 Types to be organised into hierarchies. This is the sense of “broader term generic (BTG)” as defined in ISO 25964-2:2013 (International Organization for Standardization 2013). This property is transitive. This property is asymmetric. Examples: - dime (E55) has broader term coin (E55). (Yerkes, 1989) In First Order Logic: - P127(x,y) ⇒ E55(x) - P127(x,y) ⇒ E55(y) - [P127(x,y) ∧ P127(y,z)] ⇒ P127(x,z) - P127(x,y) ⇒ ¬P127(y,x)
domain: E55 Type
label: P127 a pour terme général @fr
label: P127 hat den Oberbegriff @de
label: P127 tem termo genérico @pt
label: P127 έχει ευρύτερο όρο @el
label: P127 имеет вышестоящий термин @ru
label: P127 上位词 @zh
range: E55 Type
inverse of: P127 has narrower term
notation: P127

P80 end is qualified by
type: DatatypeProperty
type: NamedIndividual
comment: Quantification: many to one (0,1:0,n) Scope note: This property associates an instance of E52 Time-Span with a note detailing the scholarly or scientific opinions and justifications about the end of this time-span concerning certainty, precision, sources etc. This property may also be used to describe arguments constraining possible dates and to distinguish reasons for alternative dates. Examples: - The time-span of the Holocene (E52) end is qualified by “still ongoing” (E62). (Walker et al., 2009) In First Order Logic: - P80(x,y) ⇒ E52(x) - P80(x,y) ⇒ E62(y) - P80(x,y) ⇒ P3(x,y)
domain: E52 Time-Span
label: P80 a sa fin qualifiée par @fr
label: P80 final é qualificado por @pt
label: P80 hat Begründung des Endes @de
label: P80 τέλος προσδιορίζεται από @el
label: P80 конец ограничен @ru
label: P80 结束限定 @zh
sub property of: P3 has note
notation: P80

P57 has number of parts
type: DatatypeProperty
type: NamedIndividual
comment: Quantification: many to one (0,1:0,n) Scope note: This property documents the number of parts, an instance of E60 Number, of which an instance of E19 Physical Object is composed. This may be used as a method of checking inventory counts with regard to aggregate or collective objects. What constitutes a part or component depends on the context and requirements of the documentation. Normally, the parts documented in this way would not be considered as worthy of individual attention. For a more complete description, objects may be decomposed into their components and constituents using P46 is composed of (forms parts of) and P45 consists of (is incorporated in). This allows each element to be described individually. Examples: - Chess set 233 (E22) has number of parts 33 (E60). (fictitious) In First Order Logic: - P57(x,y) ⇒ E19(x) - P57(x,y) ⇒ E60(y)
domain: E19 Physical Object
domain: E31 Document
domain: MFN15 Collection Object
label: P57 a pour nombre d’éléments @fr
label: P57 hat Anzahl Teile @de
label: P57 tem número de partes @pt
label: P57 έχει αριθμό μερών @el
label: P57 имеет число частей @ru
label: P57 有组成部分数 @zh
sub property of: P3 has note
notation: P57

P90a has lower value limit
type: DatatypeProperty
type: NamedIndividual
domain: E54 Dimension
sub property of: P90 has value
notation: P90a

P21 was purpose of
type: ObjectProperty
type: NamedIndividual
comment: Quantification of the inverse property: many to many (0,n:0,n) Scope note of the inverse property: This property describes an intentional relationship between an instance of E7 Activity and some general goal or purpose, described as an instance of E55 Type. This may involve activities intended as preparation for some type of activity or event. P21 had general purpose (was purpose of) differs from P20 had specific purpose (was purpose of in that no specific event is implied as the purpose. Examples of the inverse property: - Van Eyck’s pigment grinding (E7) had general purpose painting (E55). (Borchert, 2008) - The setting of trap 2742 on 17(th) May 1874 (E7) had general purpose catching moose (E55). [activity type] (fictitious) - The construction of the Berlin Wall starting 13(th) August 1961 (E12) had general purpose preventing emigration (E55). (History.com Editors, 2020) - The reinforcement of the Mexico-United States barrier between the United States of America and Mexico in Fall 2019 (E11) had general purpose preventing immigration (E55). - The rebuilding of the city walls of Heraklion by the Venetian rulers starting in 1462 (E12) had general purpose preventing conquest by enemy (E55). (YouIngGreece.com, 2020) - The building of the seawall in Hamamatsu, Shizuoka, Japan between 2014 and 2020 (E12) had general purpose preventing inland flooding by tsunami (E55). In First Order Logic of the inverse property: - P21(x,y) ⇒ E7(x) - P21(x,y) ⇒ E55(y)
domain: E55 Type
label: P21 a été la finalité de @fr
label: P21 era o propósito de @pt
label: P21 war Zweck von @de
label: P21 ήταν σκοπός του/της @el
label: P21 был целью для @ru
label: P21 是为了 @zh
range: E7 Activity
notation: P21i

E12 Production
type: Class
type: NamedIndividual
comment: Scope note: This class comprises activities that are designed to, and succeed in, creating one or more new items. It specializes the notion of modification into production. The decision as to whether or not an object is regarded as new is context sensitive. Normally, items are considered “new” if there is no obvious overall similarity between them and the consumed items and material used in their production. In other cases, an item is considered “new” because it becomes relevant to documentation by a modification. For example, the scribbling of a name on a potsherd may make it a voting token. The original potsherd may not be worth documenting, in contrast to the inscribed one. This entity can be collective: the printing of a thousand books, for example, would normally be considered a single event. An event should also be documented using an instance of E81 Transformation if it results in the destruction of one or more objects and the simultaneous production of others using parts or material from the originals. In this case, the new items have separate identities and matter is preserved, but identity is not. Examples: - the construction of the SS Great Britain (Gregor, 1971) - the first casting of the Little Mermaid from the harbour of Copenhagen (Dewey, 2003) - Rembrandt’s creating of the seventh state of his etching “Woman sitting half dressed beside a stove”, 1658, identified by Bartsch Number 197 (E12, E65, E81) (Hind, 1923) In First Order Logic: - E12(x) ⇒ E11(x) - E12(x) ⇒ E63(x)
label: E12 Herstellung @de
label: E12 Produção @pt
label: E12 Παραγωγή @el
label: E12 Событие Производства @ru
label: E12 生产 @zh
subclass of: E11 Modification
subclass of: E63 Beginning of Existence
subclass of: Restriction
  on property: P108 has produced
  some values from: E24 Physical Human-Made Thing
notation: E12

P5 consists of
type: ObjectProperty
type: TransitiveProperty
type: NamedIndividual
comment: Quantification: many to many (0,n:0,n) Scope note: This property describes the decomposition of an instance of E3 Condition State into discrete, subsidiary states. It is assumed that the sub-states into which the condition state is analysed form a logical whole, although the entire story may not be completely known, and that the sub-states are in fact constitutive of the general condition state. For example, a general condition state of “in ruins” may be decomposed into the individual stages of decay. This property is transitive and asymmetric. Examples: - The Condition State of the ruined Parthenon (E3) consists of the bombarded state after the explosion of a Venetian shell in 1687 (E3). (Mommsen, 1941) In First Order Logic: - P5(x,y) ⇒ E3(x) - P5(x,y) ⇒ E3(y) - [P5(x,y) ∧ P5(y,z)] ⇒ P5(x,z) - P5(x,y) ⇒ ¬P5(y,x)
domain: E3 Condition State
label: P5 besteht aus @de
label: P5 comprend @fr
label: P5 consiste de @pt
label: P5 αποτελείται από @el
label: P5 состоит из @ru
label: P5 包括 @zh
range: E3 Condition State
inverse of: P5 forms part of
notation: P5

P143 joined
type: ObjectProperty
type: NamedIndividual
comment: Quantification: many to many, necessary (1,n:0,n) Scope note: This property identifies the instance of E39 Actor that becomes member of an instance of E74 Group in an instance of E85 Joining. Joining events allow for describing actors becoming members of a group with the more detailed path E74 Group, P144i gained member by, E85 Joining, P143 joined, E39 Actor, compared to the shortcut offered by P107 has current or former member (is current or former member of). Examples: - The election of Sir Isaac Newton as Member of Parliament to the Convention Parliament of 1689 (E85) joined Sir Isaac Newton (E21). (Iliffe, 2013) - The inauguration of Mikhail Sergeyevich Gorbachev as leader of the Union of Soviet Socialist Republics (USSR) in 1985 (E85) joined Mikhail Sergeyevich Gorbachev (E21). (Galeotti, 1997) - The implementation of the membership treaty 1(st) January 1973 between EU and Denmark (E85) joined Denmark (E74). In First Order Logic: - P143(x,y) ⇒ E85(x) - P143(x,y) ⇒ E39(y) - P143(x,y) ⇒ P11(x,y)
domain: E85 Joining
label: P143 a fait adhérer @fr
label: P143 verband @de
label: P143 加入 @zh
range: E39 Actor
sub property of: P11 had participant
inverse of: P143 was joined by
notation: P143

P198 holds or supports
type: ObjectProperty
type: TransitiveProperty
type: NamedIndividual
comment: Quantification: one to many (0,n:0,n) Scope note: This property relates one instance of E18 Physical Thing which acts as a container or support to a supported or contained instance of E18 Physical Thing. Typical examples of E18 Physical Things which are intended to function as a container or support include shelves, folders or boxes. These containers or supports provide a stable surface which is intended for other physical objects to be placed upon for storage, display, transport or other similar functions. This property is a shortcut of the more fully developed path from E18 Physical Thing through P59 has section, E53 Place, P53i is former or current location of, to E18 Physical Thing. It is not a sub-property of P46 is composed of, as the held or supported object is not a component of the container or support. This property can be used to avoid explicitly instantiating the E53 Place which is defined by an instance of E18 Physical Thing, especially when the only intended use of that instance of E18 Physical Thing is to act as a container or surface for the storage of other instances of E18 Physical Thing. The place’s existence is defined by the existence of the container or surface, and will go out of existence at the same time as the destruction of the container or surface. This property is transitive. This property is asymmetric. Examples: - Archival folder “6” (E22) holds or supports the piece of paper carrying the text of a letter from Lawrence Alloway to Sylvia Sleigh (E22). - [ http://archives2.getty.edu:8082/xtf/view?docId=ead/2003.M.46/2003.M.46.xml;chunk.id=aspace_ref12_kf7;brand=default] - Archival folder "17" (E22) holds or supports the daguerreotype that shows the image of Henry Ward Beecher as a young man (E22). - [ https://archives.yale.edu/repositories/12/archival_objects/1402266] - Box "88" (E22) holds or supports folder "17" (E22). [ https://archives.yale.edu/repositories/12/archival_objects/1402266] - Bookshelf “GRI-708.1” (E22) holds or supports …
domain: E18 Physical Thing
label: P198 contient ou soutient @fr
range: E18 Physical Thing
inverse of: P198 is held or supported by
notation: P198

E42 Identifier
type: Class
type: NamedIndividual
comment: Scope note: This class comprises strings or codes assigned to instances of E1 CRM Entity in order to identify them uniquely and permanently within the context of one or more organisations. Such codes are often known as inventory numbers, registration codes, etc. and are typically composed of alphanumeric sequences. Postal addresses, telephone numbers, URLs and e-mail addresses are characteristic examples of identifiers used by services transporting things between clients. The class E42 Identifier is not normally used for machine-generated identifiers used for automated processing unless these are also used by human agents. Examples: - “MM.GE.195” - “13.45.1976” - “OXCMS: 1997.4.1” (fictitious) - “ISSN 0041-5278” [Identifier for “The UNESCO Courier (Print)”] - ISRC “FIFIN8900186” [Identifier for : Kraft (29 min 14 s) / Magnus Lindberg, comp. ; Toimii Ensemble ; Swedish Radio symphony orchestra ; Esa-Pekka Salonen, dir.] - Shelf mark “Res 8 P 10” - “Guillaume de Machaut (1300?-1377)” [a controlled personal name heading that follows the French rules] (Reaney, 1974) - “+41 22 418 5571” - “ weasel@paveprime.com” - “Rue David Dufour 5, CH-1211, Genève” - “1-29-3 Otsuka, Bunkyo-ku, Tokyo, 121, Japan” In First Order Logic: - E42(x) ⇒ E41(x)
label: E42 Identifiant @fr
label: E42 Identificador de Objeto @pt
label: E42 Kennung @de
label: E42 Κωδικός Αναγνώρισης @el
label: E42 Идентификатор Объекта @ru
label: E42 标识符 @zh
subclass of: E41 Appellation
notation: E42

P110 was augmented by
type: ObjectProperty
type: NamedIndividual
comment: Quantification of the inverse property: many to many, necessary (1,n:0,n) Scope note of the inverse property: This property identifies the instance of E18 Physical Thing that is added to (augmented) in an instance of E79 Part Addition. Although an instance of E79 Part Addition event normally concerns only one instance of E18 Physical Thing, it is possible to imagine circumstances under which more than one item might be added to (augmented). For example, the artist Jackson Pollock trailing paint onto multiple canvasses. Examples of the inverse property: - The final nail-insertion Event (E79) augmented Coffin of George VI (E22). (https://www.rct.uk/collection/2000811/the-coffin-of-king-george-vi-during-the-lying-in-state) - The attachment of the bronze hand of the Alpi Marittime sculpture (E79) augmented the tree of the Alpi Marittime sculpture (E20). [https://giuseppepenone.com/en/words/maritime-alps] (Mangini, 2010) In First Order Logic of the inverse property: - P110(x,y) ⇒ E79(x) - P110(x,y) ⇒ E18(y) - P110(x,y) ⇒ P31(x,y)
domain: E18 Physical Thing
label: P110 a été augmenté par @fr
label: P110 foi aumentada por @pt
label: P110 wurde erweitert durch @de
label: P110 επαυξήθηκε από @el
label: P110 был увеличен посредством @ru
label: P110 被增强 @zh
range: E79 Part Addition
sub property of: P31 was modified by
notation: P110i

P94 has created
type: ObjectProperty
type: NamedIndividual
comment: Quantification: one to many, necessary, dependent (1,n:1,1) Scope note: This property links an instance of E65 Creation to the instance of E28 Conceptual Object created by it. It represents the act of conceiving the intellectual content of the instance of E28 Conceptual Object. It does not represent the act of creating the first physical carrier of the instance of E28 Conceptual Object. As an example, this is the composition of a poem, not its commitment to paper. Examples: - The composition of “The Four Friends” by A. A. Milne (E65) has created “The Four Friends” by A. A. Milne (E33). (Milne, 2012) In First Order Logic: - P94(x,y) ⇒ E65(x) - P94(x,y) ⇒ E28(y) - P94(x,y) ⇒ P92(x,y)
domain: E65 Creation
label: P94 a créé @fr
label: P94 criou @pt
label: P94 hat erschaffen @de
label: P94 δημιούργησε @el
label: P94 создал @ru
label: P94 已创建了 @zh
range: E28 Conceptual Object
sub property of: P92 brought into existence
inverse of: P94 was created by
notation: P94

P184 ends with or after the end of
type: ObjectProperty
type: NamedIndividual
comment: Quantification of the inverse property: many to many (0,n:0,n) Scope note of the inverse property: This property specifies that the temporal extent of the domain instance A of E2 Temporal Entity ends before or simultaneously with the end of the temporal extent of the range instance B of E2 Temporal Entity. In other words, if A = [A(start), A(end)] and B = [B(start), B(end)], it means A(end) ≤ B(end )is true. This property is part of the set of temporal primitives P173 – P176, P182 – P185. This property corresponds to a disjunction (logical OR) of the following Allen temporal relations (Allen, 1983): {before, meets, overlaps, finished by, start, equals, during, finishes}. This property is irreflexive https://cidoc-crm.org/html/version_images/images_7.1.3/image_13.png Figure 20: Temporal entity A ends before or with the end of temporal entity B. Here A is longer than B https://cidoc-crm.org/html/version_images/images_7.1.3/image_14.png Figure 21: Temporal entity A ends before or with the end of temporal entity B. Here A is shorter than B Examples of the inverse property: - The reign/life of Harold II (E4) ends before or with the end of the Battle of Hastings (E7) In First Order Logic of the inverse property: - P184(x,y) ⇒ E2(x) - P184(x,y) ⇒ E2(y) - P184(x,y) ⇒ P174(x,y) - ¬P184(x,x)
domain: E2 Temporal Entity
label: P184 se termine au moment de ou après la fin de @fr
range: E2 Temporal Entity
sub property of: P174 ends after the start of
notation: P184i

E13 Attribute Assignment
type: Class
type: NamedIndividual
comment: Scope note: This class comprises the actions of making assertions about one property of an object or any single relation between two items or concepts. The type of the property asserted to hold between two items or concepts can be described by the property P177 assigned property of type (is type of property assigned): E55 Type. For example, the class describes the actions of people making propositions and statements during certain scientific/scholarly procedures, e.g. the person and date when a condition statement was made, an identifier was assigned, the museum object was measured, etc. Which kinds of such assignments and statements need to be documented explicitly in structures of a schema rather than free text, depends on whether this information should be accessible by structured queries. This class allows for the documentation of how the respective assignment came about, and whose opinion it was. Note that all instances of properties described in a knowledge base are the opinion of someone. Per default, they are the opinion of the team maintaining the knowledge base. This fact must not individually be registered for all instances of properties provided by the maintaining team, because it would result in an endless recursion of whose opinion was the description of an opinion. Therefore, the use of instances of E13 Attribute Assignment marks the fact that the maintaining team is in general neutral to the validity of the respective assertion, but registers someone else’s opinion and how it came about. All properties assigned in such an action can also be seen as directly relating the respective pair of items or concepts. Multiple use of instances of E13 Attribute Assignment may possibly lead to a collection of contradictory values. Examples: - the examination of MS Sinai Greek 418 by Nicholas Pickwoad in November 2003 (Honey & Pickwoad, 2010) - the assessment of the current ownership of Martin Doerr’s silver cup in February 1997 (fictitious) In First Order Logic: …
label: E13 Assignation d’attribut @fr
label: E13 Atribuição de Característica @pt
label: E13 Merkmalszuweisung @de
label: E13 Απόδοση Ιδιοτήτων @el
label: E13 Присвоение Атрибута @ru
label: E13 属性赋值 @zh
subclass of: E7 Activity
subclass of: Restriction
  on property: P140 assigned attribute to
  some values from: E1 CRM Entity
notation: E13

E54 Dimension
type: Class
type: NamedIndividual
comment: Scope note: This class comprises quantifiable properties that can be measured by some calibrated means and can be approximated by values, i.e. points or regions in a mathematical or conceptual space, such as natural or real numbers, RGB values, etc. An instance of E54 Dimension represents the empirical or theoretically derived quantity, including the precision tolerances resulting from the particular method or calculation. The identity of an instance of E54 Dimension depends on the method of its determination because each method may produce different values even when determining comparable qualities. For instance, the wingspan of a bird alive or dead is a different dimension. Thermoluminescence dating and Rehydroxylation [RHX] dating are different dimensions of temporal distance from now, even if they aim at dating the same object. The method of determination should be expressed using the property P2 has type (is type of). Note that simple terms such as “diameter” or “length” are normally insufficient to unambiguously describe a respective dimension. In contrast, “maximum linear extent” may be sufficient. The properties of the class E54 Dimension allow for expressing the numerical approximation of the values of instances of E54 Dimension adequate to the precision of the applied method of determination. If the respective quantity belongs to a non-discrete space according to the laws of physics, such as spatial distances, it is recommended to record them as approximations by intervals or regions of indeterminacy enclosing the assumed true values. For instance, a length of 5 cm may be recorded as 4.5-5.5 cm, according to the precision of the respective observation. Note, that comparability of values described in different units depends critically on the representation as value regions. Numerical approximations in archaic instances of E58 Measurement Unit used in historical records should be preserved. Equivalents corresponding to current knowledge should be recorded as…
label: E54 Dimensão @pt
label: E54 Maß @de
label: E54 Μέγεθος @el
label: E54 Величина @ru
label: E54 度量规格 @zh
subclass of: E1 CRM Entity
subclass of: Restriction
  cardinality: 1
  on property: P91 has unit
notation: E54

P113 was removed by
type: ObjectProperty
type: NamedIndividual
comment: Quantification of the inverse property: many to many, necessary (1,n:0,n) Scope note of the inverse property: This property identifies the instance of E18 Physical Thing that is removed during an instance of E80 Part Removal activity. Examples of the inverse property: - The opening of the coffin of Tut-Ankh-Amun (E80) removed The mummy of Tut-Ankh-Amun (E20, E22). (Carter, 2014) In First Order Logic of the inverse property: - P113(x,y) ⇒ E80(x) - P113(x,y) ⇒ E18(y) - P113(x,y) ⇒ P12(x,y)
domain: E18 Physical Thing
label: P113 a été retiré par @fr
label: P113 foi removido por @pt
label: P113 wurde entfernt durch @de
label: P113 αφαιρέθηκε από @el
label: P113 был удален посредством @ru
label: P113 被去除 @zh
range: E80 Part Removal
sub property of: P12 was present at
notation: P113i

P121 overlaps with
type: ObjectProperty
type: SymmetricProperty
type: NamedIndividual
comment: Quantification: many to many (0,n:0,n) Scope note: This symmetric property associates an instance of E53 Place with another instance of E53 Place geometrically overlapping it. It does not specify anything about the shared area. This property is purely spatial. It does not imply that phenomena that define, by their extent, places related by P121 overlaps with have ever covered a common area at the same time or even coexisted. In contrast, spatiotemporal overlaps described by P132 spatiotemporally overlaps are the total of areas simultaneously covered by the related spacetime volumes. This property is symmetric. This property is reflexive. Examples: - The territory of the United States as in 2020 (E53) overlaps with the Arctic (E53). (Gannett et al., 1904) - The maximal extent of the Kingdom of Greece (1832-1973) (E53) overlaps with the maximal extent of the Republic of Turkey (29(th) October 1923 to now) (E53). In First Order Logic: - P121(x,y) ⇒ E53(x) - P121(x,y) ⇒ E53(y) - P121(x,y) ⇒ P121(y,x) - P121(x,x)
domain: E53 Place
label: P121 se superpose partiellement à @fr
label: P121 sobrepõe com @pt
label: P121 überlappt mit @de
label: P121 επικαλύπτεται με @el
label: P121 пересекается с @ru
label: P121 重叠于 @zh
range: E53 Place
notation: P121

P161 is spatial projection of
type: ObjectProperty
type: NamedIndividual
comment: Quantification of the inverse property: many to many, necessary (1,n:0,n) Scope note of the inverse property: This property associates an instance of E92 Spacetime Volume with an instance of E53 Place that is the result of the spatial projection of the instance of the E92 Spacetime Volume on a reference space. In general, there can be more than one useful reference space (for reference space see P156 occupies and P157 is at rest relative to) to describe the spatial projection of a spacetime volume, for example, in describing a sea battle, the difference between the battle ship and the seafloor as reference spaces. Thus, it can be seen that the projection is not unique. The spatial projection is the actual spatial coverage of a spacetime volume, which normally has fuzzy boundaries except for instances of E92 Spacetime Volume which are geometrically defined in the same reference system as the range of this property and are an exception to this and do not have fuzzy boundaries. Modelling explicitly fuzzy spatial projections serves therefore as a common topological reference of different spatial approximations rather than absolute geometric determination, for instance for relating outer or inner spatial boundaries for the respective spacetime volumes. The spatial projection is unique with respect to the reference system. For instance, there is exactly one spatial projection of Lord Nelson’s dying relative to the ship HMS Victory, i.e. the location of his body relative to the ship HMS Victory at the time of his death. In case the domain of an instance of P161 has spatial projection is an instance of E4 Period, the spatial projection describes all areas that period was ever present at, for instance, the Roman Empire. This property is part of the fully developed path from E18 Physical Thing through P196 defines, E92 Spacetime Volume, P161 has spatial projection to E53 Place, which in turn is implied by P156 occupies (is occupied by). Examples of the inverse property: - The…
domain: E53 Place
label: P161 est la projection spatiale de @fr
range: E92 Spacetime Volume
notation: P161i

P174 ends after the start of
type: ObjectProperty
type: NamedIndividual
comment: Quantification of the inverse property: many to many (0,n:0,n) Scope note of the inverse property: This property specifies that the temporal extent of the domain instance A of E2 Temporal Entity starts definitely before the end of the temporal extent of the range instance B of E2 Temporal Entity. In other words, if A = [A(start), A(end)] and B = [B(start), B(end)], it means A(start) < B(end) is true. This property is part of the set of temporal primitives P173 – P176, P182 – P185. This property corresponds to a disjunction (logical OR) of the following Allen temporal relations (Allen, 1983): {before, meets, overlaps, starts, started-by, contains, finishes, finished-by, equals, during, overlapped by} Typically, this property is a consequence of a known influence of some event on another event or activity, such as a novel written by someone being continued by someone else, or the knowledge of a defeat on a distant battlefield causing people to end their ongoing activities. This property is not transitive. This property is irreflexive. https://cidoc-crm.org/html/version_images/images_7.1.3/image_03.png Figure 10: Temporal entity A starts before the end of temporal entity B. Here A is longer than B https://cidoc-crm.org/html/version_images/images_7.1.3/image_04.png Figure 11: Temporal entity A starts before the end of temporal entity B. Here A is shorter than B Examples of the inverse property: - The settling activity of the city of Assur (Ashur) (E7) starts before the end of The Tenth Dynasty of Egypt (E4). [There are some 200 - 300 years differences in the chronology of the First Intermediate Period, and Assur is dated to “about 2500 BC”.] (Pedersén, 1986) - The building of the current St. Peters in Rome (E7) starts before the end of the demolition of the old 4(th) c. St. Peters (E6, E7) (Bosman, 2004) In First Order Logic of the inverse property: - P174(x,y) ⇒ E2(x) - P174(x,y) ⇒ E2(y) - P174(x,y) ⇒ P173(x,y) - ¬P174(x,x)
domain: E2 Temporal Entity
label: P174 se termine après le début de @fr
range: E2 Temporal Entity
sub property of: P173 ends after or with the start of
notation: P174i

P128 carries
type: ObjectProperty
type: NamedIndividual
comment: Quantification: many to many (0,n:0,n) Scope note: This property identifies an instance E90 Symbolic Object carried by an instance of E18 Physical Thing. Since an instance of E90 Symbolic Object is defined as an immaterial idealization over potentially multiple carriers, any individual realization on a particular physical carrier may be defective, due to deterioration or shortcomings in the process of creating the realization compared to the intended ideal. As long as such defects do not substantially affect the complete recognition of the respective symbolic object, it is still regarded as carrying an instance of this E90 Symbolic Object. If these defects are of scholarly interest, the particular realization can be modelled as an instance of E25 Human-Made Feature. Note, that any instance of E90 Symbolic Object incorporated (P165) in the carried symbolic object is also carried by the same instance of E18 Physical Thing. Examples: - Matthew’s paperback copy of Reach for the Sky (E18) carries the text of Reach for the Sky (E73). [see also: (Brickhill, 2001)] (fictitious) In First Order Logic: - P128(x,y) ⇒ E18(x) - P128(x,y) ⇒ E90(y) - P128(x,y) ⇒ P130(x,y)
domain: E18 Physical Thing
label: P128 est le support de @fr
label: P128 trägt @de
label: P128 é o suporte de @pt
label: P128 φέρει @el
label: P128 несет @ru
label: P128 承载 @zh
range: E90 Symbolic Object
sub property of: P130 shows features of
inverse of: P128 is carried by
notation: P128

P179 was sales price of
type: ObjectProperty
type: NamedIndividual
comment: Quantification of the inverse property: many to many (1,n:0,n) Scope note of the inverse property: This property establishes the relationship between an instance of E96 Purchase and the instance of E97 Monetary Amount that forms the compensation for the transaction. The monetary amount agreed upon may change in the course of the purchase activity. Examples of the inverse property: - The sale of Vincent van Gogh’s “Still Life: Vase with Fifteen Sunflowers” 30(th) March 1987 (E96) had sales price Christie’s hammer price for “Still Life: Vase with Fifteen Sunflowers” (E97). - The purchase of 10 okka of nails by the captain A. Syrmas on 18(th) September 1895 (E96) had sales price 20 piastre (grosi) (E97). (Syrmas, 1896) In First Order Logic of the inverse property: - P179(x,y) ⇒ E96(x) - P179(x,y) ⇒ E97(y)
domain: E97 Monetary Amount
label: P179 a été le prix de vente de @fr
range: E96 Purchase
notation: P179i

E6 Destruction
type: Class
type: NamedIndividual
comment: Scope note: This class comprises events that destroy one or more instances of E18 Physical Thing, such that they lose their identity as the subjects of documentation. Some destruction events are intentional, while others are independent of human activity. Intentional destruction can be documented by classifying the event as both an instance of E6 Destruction and of E7 Activity. The decision to document an object as destroyed, transformed, or modified is context-sensitive: 1. If the matter remaining from the destruction is not documented, the event is modelled solely as an instance of E6 Destruction. 2. An event should also be documented using E81 Transformation if it results in the destruction of one or more objects and the simultaneous production of others using parts or material from the original. In this case, the new items have separate identities. Matter is preserved, but identity is not. 3. When the initial identity of the changed instance of E18 Physical Thing is preserved, the event should be documented as an instance of E11 Modification. Examples: - the destruction of Herculaneum by volcanic eruption in 79 AD (Camardo, 2013) - the destruction of Nineveh (E6, E7) (River, 2016) - the breaking of a champagne glass yesterday by my dog (fictitious) In First Order Logic: - E6(x) ⇒ E64(x)
label: E6 Destruição @pt
label: E6 Zerstörung @de
label: E6 Καταστροφή @el
label: E6 Разрушение @ru
label: E6 破坏 @zh
subclass of: E64 End of Existence
subclass of: Restriction
  on property: P13 destroyed
  some values from: E18 Physical Thing
notation: E6

P94 was created by
type: ObjectProperty
type: NamedIndividual
comment: Quantification of the inverse property: one to many, necessary, dependent (1,n:1,1) Scope note of the inverse property: This property links an instance of E65 Creation to the instance of E28 Conceptual Object created by it. It represents the act of conceiving the intellectual content of the instance of E28 Conceptual Object. It does not represent the act of creating the first physical carrier of the instance of E28 Conceptual Object. As an example, this is the composition of a poem, not its commitment to paper. Examples of the inverse property: - The composition of “The Four Friends” by A. A. Milne (E65) has created “The Four Friends” by A. A. Milne (E33). (Milne, 2012) In First Order Logic of the inverse property: - P94(x,y) ⇒ E65(x) - P94(x,y) ⇒ E28(y) - P94(x,y) ⇒ P92(x,y)
domain: E28 Conceptual Object
label: P94 a été créé par @fr
label: P94 foi criado por @pt
label: P94 wurde erschaffen durch @de
label: P94 δημιουργήθηκε από @el
label: P94 был создан посредством @ru
label: P94 被创建 @zh
range: E65 Creation
sub property of: P92 was brought into existence by
notation: P94i

P185 ends before the end of
type: ObjectProperty
type: TransitiveProperty
type: NamedIndividual
comment: Quantification: many to many (0,n:0,n) Scope note: This property specifies that the temporal extent of the domain instance A of E2 Temporal Entity ends definitely before the end of the temporal extent of the range instance B of E2 Temporal Entity. In other words, if A = [A(start), A(end)] and B = [B(start), B(end)], it means A(end) < B(end )is true. This property is part of the set of temporal primitives P173 – P176, P182 – P185. This property corresponds to a disjunction (logical OR) of the following Allen temporal relations (Allen, 1983): {before, meets, overlaps, starts, during}. This property is transitive. This property is asymmetric. https://cidoc-crm.org/html/version_images/images_7.1.3/image_15.png Figure 22: Temporal entity A ends before the end of temporal entity B. Here A is longer than B https://cidoc-crm.org/html/version_images/images_7.1.3/image_16.png Figure 23: Temporal entity A ends before the end of temporal entity B. Here A is shorter than B Examples: - Godstow Abbey, Oxfordshire as a working abbey (E4 Period) ends before the end of the reign of Henry VIII (E4 Period). In First Order Logic: - P185(x,y) ⇒ E2(x) - P185(x,y) ⇒ E2(y) - P185(x,y) ⇒ P184(x,y) - [P185(x,y) ∧ P185(y,z)] ⇒ P185(x,z)P185(x,y) ⇒ ¬P185(y,x)
domain: E2 Temporal Entity
label: P185 se termine avant la fin de @fr
range: E2 Temporal Entity
sub property of: P184 ends before or with the end of
inverse of: P185 ends after the end of
notation: P185

P195 had presence
type: ObjectProperty
type: NamedIndividual
comment: Quantification of the inverse property: many to one, necessary (1,1:0,n) Scope note of the inverse property: This property associates an instance of E93 Presence with the instance of E18 Physical Thing of which it represents a temporal restriction (i.e. a time-slice) of the thing’s trajectory through spacetime. In other words, it describes where the instance of E18 Physical Thing was or moved around within a given time-span. Instantiating this property constitutes a necessary part of the identity of the respective instance of E93 Presence. This property is a shortcut of the fully developed path from E18 Physical Thing through P196 defines, E92 Spacetime Volume, P166 was a presence of (had presence) to E93 Presence. Examples of the inverse property: - Johann Joachim Winckelmann’s whereabouts in December 1755 (E93) was a presence of Johann Joachim Winckelmann (E21). (Wiencke, 1998) - Johann Joachim Winckelmann’s whereabouts from 19(th) November 1755 until 9(th) April 1768 (E93) was a presence of Johann Joachim Winckelmann (E21). (Wiencke, 1998) In First Order Logic of the inverse property: - P195(x,y) ⇒ E93(x) - P195(x,y) ⇒ E18(y) - P195(x,y) ⇔ (∃z)[E92(z) ∧ P166(z,x) ∧ P196i(z,y)]
domain: E18 Physical Thing
label: P195 a eu pour présence @fr
range: E93 Presence
notation: P195i

P82a begin of the begin
type: DatatypeProperty
type: NamedIndividual
domain: E52 Time-Span
label: P82a Anfang des Anfangs @de
label: P82a começar do início @pt
label: P82a début du début @fr
label: P82a αρχή της αρχής @el
label: P82a начать с начала @ru
sub property of: P82 at some time within
notation: P82a

E21 Person
type: Class
type: NamedIndividual
comment: Scope note: This class comprises real persons who live or are assumed to have lived. Legendary figures that may have existed, such as Ulysses and King Arthur, fall into this class if the documentation refers to them as historical figures. In cases where doubt exists as to whether several persons are in fact identical, multiple instances can be created and linked to indicate their relationship. The CIDOC CRM does not propose a specific form to support reasoning about possible identity. In a bibliographic context, a name presented following the conventions usually employed for personal names will be assumed to correspond to an actual real person (an instance of E21 Person), unless evidence is available to indicate that this is not the case. The fact that a persona may erroneously be classified as an instance of E21 Person does not imply that the concept comprises personae. Examples: - Tut-Ankh-Amun (Edwards and Boltin, 1979) - Nelson Mandela (Brown and Hort, 2006) In First Order Logic: - E21(x) ⇒ E20(x) - E21(x) ⇒ E39(x)
label: E21 Personne @fr
label: E21 Pessoa @pt
label: E21 Πρόσωπο @el
label: E21 Личность @ru
label: E21 人物 @zh
subclass of: E20 Biological Object
subclass of: E39 Actor
subclass of: Restriction
  min cardinality: 2
  on property: P152 has parent
subclass of: Restriction
  cardinality: 1
  on property: P98 was born
notation: E21

E89 Propositional Object
type: Class
type: NamedIndividual
comment: Scope note: This class comprises immaterial items, including but not limited to stories, plots, procedural prescriptions, algorithms, laws of physics or images that are, or represent in some sense, sets of propositions about real or imaginary things and that are documented as single units or serve as topic of discourse. This class also comprises items that are “about” something in the sense of a subject. In the wider sense, this class includes expressions of psychological value such as non-figural art and musical themes. However, conceptual items such as types and classes are not instances of E89 Propositional Object. This should not be confused with the definition of a type, which is indeed an instance of E89 Propositional Object. Examples: - Maxwell’s Equations (Ball, 1962) - the ideational contents of Aristotle’s book entitled ‘Metaphysics’ as rendered in the Greek texts translated in Oxford edition - the underlying prototype of any “no-smoking” sign (E36) - the common ideas of the plots of the movie “The Seven Samurai” by Akira Kurosawa and the movie “The Magnificent Seven” by John Sturges (Mellen, 2002) - the image content of the photo of the Allied Leaders at Yalta published by UPI, 1945 (E36) - the character “Little Red Riding Hood”, variants of which appear amongst others in Grimm brothers’ “Rotkäppchen”, other oral fairy tales and the film “Hoodwinked” - the place “Havnor” as invented by Ursula K. Le Guin for her “Earthsea” book series, the related maps and appearing in derivative works based on these novels In First Order Logic: - E89(x) ⇒ E28(x)
label: E89 Aussagenobjekt @de
label: E89 Objet propositionnel @fr
label: E89 命题对象 @zh
subclass of: E28 Conceptual Object
subclass of: Restriction
  on property: P129 is subject of
  some values from: E1 CRM Entity
subclass of: Restriction
  on property: P148 has component
  some values from: E89 Propositional Object
subclass of: Restriction
  on property: P67 is referred to by
  some values from: E1 CRM Entity
notation: E89

E57 Material
type: Class
type: NamedIndividual
comment: Scope note: This class is a specialization of E55 Type and comprises the concepts of materials. Instances of E57 Material may denote properties of matter before its use, during its use, and as incorporated in an object, such as ultramarine powder, tempera paste, reinforced concrete. Discrete pieces of raw-materials kept in museums, such as bricks, sheets of fabric, pieces of metal, should be modelled individually in the same way as other objects. Discrete used or processed pieces, such as the stones from Nefer Titi's temple, should be modelled as parts (cf. P46 is composed of (forms part of): E18 Physical Thing). This type is used categorically in the model without reference to instances of it, i.e. the Model does not foresee the description of instances of instances of E57 Material, e.g. “instances of gold”. It is recommended that internationally or nationally agreed codes and terminology should be used. Examples: - brick (Gurcke, 1987) - gold (Watson, 1990) - aluminium (Norman, 1986) - polycarbonate (Mhaske, 2011) - resin (Barton, 1992) In First Order Logic: - E57(x) ⇒ E55(x)
label: E57 Matériau @fr
label: E57 Υλικό @el
label: E57 Материал @ru
label: E57 材质 @zh
subclass of: E55 Type
notation: E57

P90 has value
type: DatatypeProperty
type: NamedIndividual
comment: Quantification: many to one, necessary (1,1:0,n) Scope note: This property allows an instance of E54 Dimension to be approximated by an instance of E60 Number primitive. Examples: - The height of silver cup 232 (E54) has value 226 (E60). (fictitious) - Christie’s hammer price for Vincent van Gogh’s “Still Life: Vase with Fifteen Sunflowers” in London on 30(th) March 1987 (E97) has value 24,750,000 (E60). In First Order Logic: - P90(x,y) ⇒ E54(x) - P90(x,y) ⇒ E60(y)
domain: E54 Dimension
label: P90 a pour valeur @fr
label: P90 hat Wert @de
label: P90 tem valor @pt
label: P90 έχει τιμή @el
label: P90 имеет значение @ru
label: P90 有数值 @zh
notation: P90

P186 is produced by
type: ObjectProperty
type: NamedIndividual
comment: Quantification of the inverse property: many to many (0,n:0,n) Scope note of the inverse property: This property associates an instance of E12 Production with the instance of E99 Production Type, that is, the type of the things it produces. Examples of the inverse property: - The production activity of the Volkswagen factory related to the “Standard limousine Type II” during 1949-1953 (E12) produced thing of product type Volkswagen Type 11 (Beetle) (E99). (Rieger, 2013) In First Order Logic of the inverse property: - P186(x,y) ⇒ E12(x) - P186(x,y) ⇒ E99(y) - P186(x,y) ⇒ (∃z) [E24(z) ∧ P108(x,z) ∧ P2(z,y)]
domain: E99 Product Type
label: P186 est produit par @fr
range: E12 Production
notation: P186i

E32 Authority Document
type: Class
type: NamedIndividual
comment: Scope note: This class comprises encyclopaedia, thesauri, authority lists and other documents that define terminology or conceptual systems for consistent use. Examples: - Webster's Dictionary (Herbert, 1994) - Getty Art and Architecture Thesaurus (Getty Trust, 1990) - the CIDOC Conceptual Reference Model (Gergatsoulis et al., 2010) In First Order Logic: - E32(x) ⇒ E31(x)
label: E32 Document de référence @fr
label: E32 Documento de Referência @pt
label: E32 Referenzdokument @de
label: E32 Πηγή Καθιερωμένων Όρων @el
label: E32 Официальный Документ @ru
label: E32 规范文档 @zh
subclass of: E31 Document
subclass of: Restriction
  on property: P71 lists
  some values from: E1 CRM Entity
notation: E32

P42 assigned
type: ObjectProperty
type: NamedIndividual
comment: Quantification: many to many, necessary (1,n:0,n) Scope note: This property records the type that was assigned to an entity by an E17 Type Assignment activity. Type assignment events allow a more detailed path from E1 CRM Entity through P41i was classified by, E17 Type Assignment, P42 assigned, to E55 Type for assigning types to objects compared to the shortcut offered by P2 has type (is type of). For example, a fragment of an antique vessel could be assigned the type “attic red figured belly handled amphora” by expert A. The same fragment could be assigned the type “shoulder handled amphora” by expert B. A Type may be intellectually constructed independent from assigning an instance of it. Examples: - The classification of silver cup 232 on 31(st) August 1997 (E17) assigned goblet (E55). (fictitious) In First Order Logic: - P42(x,y) ⇒ E17(x) - P42(x,y)⇒ E55(y) - P42(x,y) ⇒ P141(x,y)
domain: E17 Type Assignment
label: P42 a assigné @fr
label: P42 atribuiu @pt
label: P42 wies zu @de
label: P42 απέδωσε ως ιδιότητα @el
label: P42 назначил @ru
label: P42 分配类型 @zh
range: E55 Type
range: MFN49 Taxon
sub property of: P141 assigned
inverse of: P42 was assigned by
notation: P42

P112 diminished
type: ObjectProperty
type: NamedIndividual
comment: Quantification: many to many, necessary (1,n:0,n) Scope note: This property identifies the instance of E18 Physical Thing that was diminished by an instance of E80 Part Removal. Although an instance of E80 Part removal activity normally concerns only one instance of E18 Physical Thing, it is possible to imagine circumstances under which more than one item might be diminished by a single instance of E80 Part Removal activity. Examples: - The coffin of Tut-Ankh-Amun (E22) was diminished by the opening of the coffin of Tut-Ankh-Amun (E80). (Carter, 2014) - The coral of the Cocos Islands (E20) was diminished by the removal of the Porite coral specimen by Charles Darwin (E80). (Natural History Museum, 2010, b) In First Order Logic: - P112(x,y) ⇒ E80(x) - P112(x,y) ⇒ E18(y) - P112(x,y) ⇒ P31(x,y)
domain: E80 Part Removal
label: P112 a diminué @fr
label: P112 diminuiu @pt
label: P112 verminderte @de
label: P112 εξάλειψε @el
label: P112 уменьшил @ru
label: P112 减少了 @zh
range: E18 Physical Thing
sub property of: P31 has modified
inverse of: P112 was diminished by
notation: P112

E98 Currency
type: Class
type: NamedIndividual
comment: Scope note: This class comprises the units in which a monetary system, supported by an administrative authority or other community, quantifies and arithmetically compares all monetary amounts declared in the unit. The unit of a monetary system must describe a nominal value which is kept constant by its administrative authority and an associated banking system if it exists, and not by market value. For instance, one may pay with grams of gold, but the respective monetary amount would have been agreed as the gold price in US dollars on the day of the payment. Under this definition, British Pounds, U.S. Dollars, and European Euros are examples of currency, but “grams of gold” is not. One monetary system has one and only one currency. Instances of this class must not be confused with coin denominations, such as “Dime” or “Sestertius”. Non-monetary exchange of value in terms of quantities of a particular type of goods, such as cows, do not constitute a currency. Examples: - “As” [Roman mid republic] - “Euro” (Temperton, 1997) - “US Dollar” (Rose, 1978) In First Order Logic: - E98(x) ⇒ E58(x)
label: E98 Unité monétaire @fr
subclass of: E58 Measurement Unit
notation: E98

P146 lost member by
type: ObjectProperty
type: NamedIndividual
comment: Quantification of the inverse property: many to many, necessary (1,n:0,n) Scope note of the inverse property: This property identifies the instance of E74 Group an instance of E39 Actor leaves through an instance of E86 Leaving. Although a leaving activity normally concerns only one instance of E74 Group, it is possible to imagine circumstances under which leaving one E74 Group implies leaving another E74 Group as well. Examples of the inverse property: - The end of Sir Isaac Newton’s duty as Member of Parliament for the University of Cambridge to the Convention Parliament in 1702 (E86) separated from the Convention Parliament (E74). (Iliffe, 2013) - George Washington’s leaving office in 1797 (E86) separated from the office of President of the United States (E74). (Unger, 2015) - The implementation of the treaty regulating the termination of Greenland membership in EU between EU, Denmark and Greenland 1(st) February 1985 (E86) separated from EU (E74). In First Order Logic of the inverse property: - P146(x,y) ⇒ E86(x) - P146(x,y) ⇒ E74(y) - P146(x,y) ⇒ P11(x,y)
domain: E74 Group
label: P146 a perdu le membre par @fr
label: P146 verlor Mitglied durch @de
label: P146 失去成员 @zh
range: E86 Leaving
sub property of: P11 participated in
notation: P146i

E33_E41 Linguistic Appellation
type: Class
type: NamedIndividual
subclass of: E33 Linguistic Object
subclass of: E41 Appellation
notation: E33_E41

P184 ends before or with the end of
type: ObjectProperty
type: NamedIndividual
comment: Quantification: many to many (0,n:0,n) Scope note: This property specifies that the temporal extent of the domain instance A of E2 Temporal Entity ends before or simultaneously with the end of the temporal extent of the range instance B of E2 Temporal Entity. In other words, if A = [A(start), A(end)] and B = [B(start), B(end)], it means A(end) ≤ B(end )is true. This property is part of the set of temporal primitives P173 – P176, P182 – P185. This property corresponds to a disjunction (logical OR) of the following Allen temporal relations (Allen, 1983): {before, meets, overlaps, finished by, start, equals, during, finishes}. This property is irreflexive https://cidoc-crm.org/html/version_images/images_7.1.3/image_13.png Figure 20: Temporal entity A ends before or with the end of temporal entity B. Here A is longer than B https://cidoc-crm.org/html/version_images/images_7.1.3/image_14.png Figure 21: Temporal entity A ends before or with the end of temporal entity B. Here A is shorter than B Examples: - The reign/life of Harold II (E4) ends before or with the end of the Battle of Hastings (E7) In First Order Logic: - P184(x,y) ⇒ E2(x) - P184(x,y) ⇒ E2(y) - P184(x,y) ⇒ P174(x,y) - ¬P184(x,x)
domain: E2 Temporal Entity
label: P184 se termine avant ou au moment de la fin de @fr
range: E2 Temporal Entity
sub property of: P174 starts before the end of
inverse of: P184 ends with or after the end of
notation: P184

P11 participated in
type: ObjectProperty
type: NamedIndividual
comment: Quantification of the inverse property: many to many (0,n:0,n) Scope note of the inverse property: This property describes the active or passive participation of instances of E39 Actors in an instance of E5 Event. It documents known events in which an instance of E39 Actor has participated during the course of that actor’s life or history. The instances of E53 Place and E52 Time-Span where and when these events happened provide constraints about the presence of the related instances of E39 Actor in the past. Collective actors, i.e. instances of E74 Group, may physically participate in events via their representing instances of E21 Persons only. The participation of multiple actors in an event is most likely an indication of their acquaintance and interaction. The property implies that the actor was involved in the event but does not imply any causal relationship. For instance, someone having been portrayed can be said to have participated in the creation of the portrait. Examples of the inverse property: - Napoleon (E21) participated in The Battle of Waterloo (E7). (Dawson, 2018) - Maria (E21) participated in Photographing of Maria (E7). (fictitious) In First Order Logic of the inverse property: - P11(x,y) ⇒ E5(x) - P11(x,y) ⇒ E39(y) - P11(x,y) ⇒ P12(x,y)
domain: E39 Actor
label: P11 a participé à @fr
label: P11 nahm Teil an @de
label: P11 participa em @pt
label: P11 συμμετείχε σε @el
label: P11 участвовал в @ru
label: P11 参与 @zh
range: E5 Event
sub property of: P12 was present at
notation: P11i

P93 was taken out of existence by
type: ObjectProperty
type: NamedIndividual
comment: Quantification of the inverse property: one to many, necessary (1,n:0,1) Scope note of the inverse property: This property links an instance of E64 End of Existence to the instance of E77 Persistent Item taken out of existence by it. In the case of immaterial things, the instance of E64 End of Existence is considered to take place with the destruction of the last physical carrier. This allows an “end” to be attached to any instance of E77 Persistent Item being documented i.e. instances of E70 Thing, E72 Legal Object, E39 Actor, E41 Appellation, and E55 Type. For many instances of E77 Persistent Item we know the maximum life-span and can infer that they must have ended to exist. We assume in that case an instance of E64 End of Existence, which may be as unnoticeable as forgetting the secret knowledge by the last representative of some indigenous nation. Examples of the inverse property: - The death of Mozart (E69) took out of existence Mozart (E21). (Deutsch, 1965) In First Order Logic of the inverse property: - P93(x,y) ⇒ E64(x) - P93(x,y) ⇒ E77(y) - P93(x,y) ⇒ P12(x,y)
domain: E77 Persistent Item
label: P93 a cessé d’exister par @fr
label: P93 deixou de existir @pt
label: P93 wurde seiner Existenz beraubt durch @de
label: P93 αναιρέθηκε από @el
label: P93 прекратил существование посредством @ru
label: P93 被结束存在 @zh
range: E64 End of Existence
sub property of: P12 was present at
notation: P93i

P196 is defined by
type: ObjectProperty
type: NamedIndividual
comment: Quantification of the inverse property: one to one, necessary (1,1:0,1) Scope note of the inverse property: This property associates an instance of E18 Physical Thing with the instance of E92 Spacetime Volume that constitutes the complete trajectory of its geometric extent through spacetime for the whole time of the existence of the instance of E18 Physical Thing. An instance of E18 Physical Thing not only occupies a particular geometric space at each instant of its existence, but in the course of its existence it also forms a trajectory through spacetime, which occupies a real, that is phenomenal, volume in spacetime, i.e. the instance of E92 Spacetime Volume this property associates it with. This real spatiotemporal extent of the instance of E18 Physical Thing is regarded as being unique, in all its details and fuzziness; the identity and existence of the instance of E92 Spacetime Volume depend uniquely on the identity of the instance of E18 Physical Thing, whose existence defines it. It constitutes a phenomenal spacetime volume as defined in CRMgeo (Doerr & Hiebel, 2013). Included in this spacetime volume are both the spaces filled by the matter of the physical thing and any inner space that may exist, for instance the interior of a box. Physical things consisting of aggregations of physically unconnected objects, such as a set of chessmen, occupy a finite number of individually contiguous subsets of this spacetime volume equal to the number of objects that constitute the set and that are never connected during its existence. Examples of the inverse property: - H.M.S. Temeraire (E22) defines the spacetime volume of H.M.S. Temeraire (E92). [it was built, during 1798, in Chatham and destroyed, during 1838, in Rotherhithe] (Willis, 2010) - The Saint Titus reliquary (E22) defines the spacetime volume of the Saint Titus reliquary (E92). [the reliquary has been produced by the workshop of the Vogiatzis brothers located at Monastiraki, Athens, in 1966 as container for t…
domain: E92 Spacetime Volume
label: P196 est défini par @fr
range: E18 Physical Thing
notation: P196i

E56 Language
type: Class
type: NamedIndividual
comment: Scope note: This class is a specialization of E55 Type and comprises the natural languages in the sense of concepts. This type is used categorically in the model without reference to instances of it, i.e. the Model does not foresee the description of instances of instances of E56 Language, e.g. “instances of Mandarin Chinese”. It is recommended that internationally or nationally agreed codes and terminology should be used to denote instances of E56 Language, such as those defined in ISO 639-3:2007 and later versions. Examples: - ell [Greek] - eng [English] - epo [Esperanto] - spa [Spanish] - fra [French] In First Order Logic: - E56(x) ⇒ E55(x)
label: E56 Langue @fr
label: E56 Língua @pt
label: E56 Sprache @de
label: E56 Γλώσσα @el
label: E56 Язык @ru
label: E56 语种 @zh
subclass of: E55 Type
notation: E56

P86 falls within
type: ObjectProperty
type: TransitiveProperty
type: NamedIndividual
comment: Quantification: many to many (0,n:0,n) Scope note: This property describes the inclusion relationship between two instances of E52 Time-Span. This property supports the notion that the temporal extent of an instance of E52 Time-Span falls within the temporal extent of another instance of E52 Time-Span. It addresses temporal containment only, and no contextual link between the two instances of E52 Time-Span is implied. This property is transitive and reflexive. Examples: - The time-span of the Apollo 11 moon mission (E52) falls within the time-span of the reign of Queen Elizabeth II (E52). (Riley, 2009; Robinson, 2000) In First Order Logic: - P86(x,y) ⇒ E52(x) - P86(x,y) ⇒ E52(y) - [P86(x,y) ∧ P86(y,z)] ⇒ P86(x,z) - P86(x,x)
domain: E52 Time-Span
label: P86 está contido em @pt
label: P86 fällt in @de
label: P86 s’insère dans @fr
label: P86 περιέχεται σε @el
label: P86 содержится в @ru
label: P86 属于 @zh
range: E52 Time-Span
inverse of: P86 contains
notation: P86

P157 provides reference space for
type: ObjectProperty
type: NamedIndividual
comment: Quantification of the inverse property: many to many, necessary(1,n:0,n) Scope note of the inverse property: This property associates an instance of E53 Place with the instance of E18 Physical Thing that determines a reference space for this instance of E53 Place by being at rest with respect to this reference space. The relative stability of form of an instance of E18 Physical Thing defines its default reference space. The reference space is not spatially limited to the referred thing. For example, a ship determines a reference space in terms of which other ships in its neighbourhood may be described. Larger constellations of matter, such as continental plates, may comprise many physical features that are at rest with them and define the same reference space. Examples of the inverse property: - The spatial extent of the municipality of Athens in 2014 (E53) is at rest relative to The Royal Observatory in Greenwich (E25). (Maunder, 1900) - The place where Lord Nelson died on H.M.S. Victory (E53) is at rest relative to H.M.S. Victory (E22). (Adkin, 2005) In First Order Logic of the inverse property: - P157(x,y) ⇒ E53(x) - P157(x,y) ⇒ E18(y)
domain: E18 Physical Thing
label: P157 procure l’espace de référence pour @fr
range: E53 Place
notation: P157i

P43 has dimension
type: ObjectProperty
type: NamedIndividual
comment: Quantification: one to many, dependent (0,n:1,1) Scope note: This property records an instance of E54 Dimension of some instance of E70 Thing. In the case that the recorded property is a result of a measurement of an instance of E18 Physical Thing, this property is a shortcut of the more fully developed path from E18 Physical Thing through P39i was measured by, E16 Measurement, P40 observed dimension to E54 Dimension. It offers no information about how and when an E54 Dimension was established, nor by whom. Knowledge about an instance of E54 Dimension need not be the result of a measurement; it may be the result of evaluating data or other information, which should be documented as an instance of E13 Attribute Assignment. An instance of E54 Dimension is specific to an instance of E70 Thing. Examples: - Silver cup 232 (E22) has dimension height of silver cup 232 (E54). [which has unit (P91) mm (E58), has value (P90) 224 (E60)] (fictitious) In First Order Logic: - P43(x,y) ⇒ E70(x) - P43(x,y) ⇒ E54(y) - P43(x,y) ⇐ (∃z) [E16(z) ˄ P39i(x,z) ˄ P40(z,y)]
domain: E70 Thing
label: P43 a pour dimension @fr
label: P43 hat Dimension @de
label: P43 tem dimensão @pt
label: P43 έχει μέγεθος @el
label: P43 имеет величину @ru
label: P43 有度量规格 @zh
range: E54 Dimension
inverse of: P43 is dimension of
notation: P43

E28 Conceptual Object
type: Class
type: NamedIndividual
comment: Scope note: This class comprises non-material products of our minds and other human produced data that have become objects of a discourse about their identity, circumstances of creation, or historical implication. The production of such information might have been supported by the use of technical devices such as cameras or computers. Characteristically, instances of this class are created, invented or thought by someone, and then may be documented or communicated between persons. Instances of E28 Conceptual Object have the ability to exist on more than one particular carrier at the same time, such as paper, electronic signals, marks, audio media, paintings, photos, human memories, etc. They cannot be destroyed. They exist as long as they can be found on at least one carrier or in at least one human memory. Their existence ends when the last carrier and the last memory are lost. Examples: - Beethoven’s “Ode an die Freude” (Ode to Joy) (E73) (Kershaw, 1999) - the definition of “ontology” in the Oxford English Dictionary (E73) (Oxford University Press, 1989) - the knowledge about the victory at Marathon carried by the famous runner (E89) (Lagos & Karyanos, 2020) - [Explanation note: The following examples illustrate the distinction between a propositional object, its names and its encoded forms. The Maxwell equations (Ball, 1962) are a good example, because they belong to the fundamental laws of physics and their mathematical content yields identical, unambiguous results regardless formulation and encoding.] - “Maxwell equations” (E41) [preferred subject access point from LCSH, http://lccn.loc.gov/sh85082387, accessed 18(th) April 2021. This is only the name for the Maxwell equations as standardized by the Library of Congress and not the equations themselves.] - “Equations, Maxwell” (E41) [variant subject access point from LCSH, http://lccn.loc.gov/sh85082387, accessed 18(th) April 2021. This is another name for the equation standardized by the Library of Congress and…
label: E28 Begrifflicher Gegenstand @de
label: E28 Objet conceptuel @fr
label: E28 Objeto Conceitual @pt
label: E28 Νοητικό Αντικείμενο @el
label: E28 Концептуальный Объект @ru
label: E28 概念对象 @zh
subclass of: E71 Human-Made Thing
subclass of: Restriction
  on property: P94 was created by
  some values from: E65 Creation
notation: E28

P2 has type
type: ObjectProperty
type: NamedIndividual
comment: Quantification: many to many (0,n:0,n) Scope note: This property allows sub-typing of CIDOC CRM entities –a form of specialisation – through the use of a terminological hierarchy, or thesaurus. The CIDOC CRM is intended to focus on the high-level entities and relationships needed to describe data structures. Consequently, it does not specialise entities any further than is required for this immediate purpose. However, entities in the isA hierarchy of the CIDOC CRM may by specialised into any number of sub-entities, which can be defined in the E55 Type hierarchy. E41 Appellation, for example, may be specialised into “e-mail address”, “telephone number”, “post office box”, “URL”, etc., none of which figures explicitly in the CIDOC CRM class hierarchy. A comprehensive explanation about refining CIDOC CRM concepts by E55 Type is given in the section “About Types” in the section on “Specific Modelling Constructs” of this document. This property is a shortcut for the path from E1 CRM Entity through P41i was classified by, E17 Type Assignment, P42 assigned to E55 Type. Examples: - “enquiries@cidoc-crm.org” (E41) has type e-mail address (E55). (fictitious) In First Order Logic: - P2(x,y) ⇒ E1(x) - P2(x,y) ⇒ E55(y) - P2(x,y) ⇐ (∃z) [E17(z)] ˄ P41i(x,z) ˄ P42(z,y)]
domain: E1 CRM Entity
label: P2 a pour type @fr
label: P2 hat den Typus @de
label: P2 é do tipo @pt
label: P2 έχει τύπο @el
label: P2 имеет тип @ru
label: P2 有类型 @zh
range: E55 Type
inverse of: P2 is type of
notation: P2

P30 transferred custody of
type: ObjectProperty
type: NamedIndividual
comment: Quantification: many to many, necessary (1,n:0,n) Scope note: This property identifies the instance(s) of E18 Physical Thing concerned in an instance of E10 Transfer of Custody. The property will typically describe the object that is handed over by an instance of E39 Actor to the custody of another instance of E39 Actor. On occasion, physical custody may be transferred involuntarily or illegally, e.g. through accident, unsolicited donation, or theft. Examples: - The delivery of the paintings by Secure Deliveries Inc. to the National Gallery (E10) transferred custody of paintings from The Iveagh Bequest (E19). In First Order Logic: - P30(x,y) ⇒ E10(x) - P30(x,y) ⇒ E18(y)
domain: E10 Transfer of Custody
label: P30 a transféré la garde de @fr
label: P30 transferida custódia de @pt
label: P30 übertrug Gewahrsam über @de
label: P30 μετεβίβασε κατοχή του/της/των @el
label: P30 передало опеку на @ru
label: P30 转移监护权的是 @zh
range: E18 Physical Thing
inverse of: P30 custody transferred through
notation: P30

P109 has current or former curator
type: ObjectProperty
type: NamedIndividual
comment: Quantification: many to many, necessary (1,n:0,n) Scope note: This property identifies the instance of E39 Actor who assumed or has assumed overall curatorial responsibility for an instance of E78 Curated Holding. It does not allow a history of curation to be recorded. This would require use of an event initiating a curator being responsible for a collection. Examples: - The Robert Opie Collection (E78) has current or former curator Robert Opie (E21). (https://www.robertopiecollection.com/) - The Mikael Heggelund Foslie’s coralline red algae Herbarium (E78) has current or former curator Mikael Heggelund Foslie (E21). (Woelkerling et al., 2005) In First Order Logic: - P109(x,y) ⇒ E78(x) - P109(x,y) ⇒ E39(y) - P109(x,y) ⇒ P49(x,y)
domain: E78 Curated Holding
label: P109 a pour responsable actuel ou antérieur de la collection @fr
label: P109 hat derzeitigen oder früheren Kurator @de
label: P109 tem ou teve curador @pt
label: P109 έχει ή είχε επιμελητή @el
label: P109 имеет действующего или бывшего хранителя @ru
label: P109 有当前或以往管理者 @zh
range: E39 Actor
sub property of: P49 has former or current keeper
inverse of: P109 is current or former curator of
notation: P109

P105 right held by
type: ObjectProperty
type: NamedIndividual
comment: Quantification: many to many (0,n:0,n) Scope note: This property identifies the instance of E39 Actor who holds the instances of E30 Right to an instance of E72 Legal Object. It is a superproperty of P52 has current owner (is current owner of) because ownership is a right that is held on the owned object. This property is a shortcut of the fully developed path from E72 Legal Object, P104 is subject to, E30 Right, P75i is possessed by to E39 Actor. Examples: - The Beatles back catalogue (E73) right held by Michael Jackson (E21). (Raga, 2016) In First Order Logic: - P105(x,y) ⇒ E72(x) - P105(x,y) ⇒ E39(y) - P105(x,y) ⇐ (∃z) [E30(z) ˄ P104(x,z) ˄ P75i(z,y)]
domain: E72 Legal Object
label: P105 Rechte stehen zu @de
label: P105 droit détenu par @fr
label: P105 são direitos de @pt
label: P105 δικαίωμα κατέχεται από @el
label: P105 право принадлежит @ru
label: P105 持有权利的是 @zh
range: E39 Actor
inverse of: P105 has right on
notation: P105

P175 starts after or with the start of
type: ObjectProperty
type: NamedIndividual
comment: Quantification of the inverse property: many to many (0,n:0,n) Scope note of the inverse property: This property specifies that the temporal extent of the domain instance A of E2 Temporal Entity starts before or simultaneously with the start of the temporal extent of the range instance B of E2 Temporal Entity. In other words, if A = [A(start), A(end)] and B = [B(start), B(end)], it means A(start) ≤ B(start) is true. This property is part of the set of temporal primitives P173 – P176, P182 – P185. This property corresponds to a disjunction (logical OR) of the following Allen temporal relations (Allen, 1983): {before, meets, overlaps, starts, started-by, contains, finished-by, equals} In a model with fuzzy borders, this property will not be transitive. This property is irreflexive. https://cidoc-crm.org/html/version_images/images_7.1.3/image_05.png Figure 12: Temporal entity A starts before or with the start of temporal entity B. Here A is longer than B https://cidoc-crm.org/html/version_images/images_7.1.3/image_06.png Figure 13: Temporal entity A starts before or with the start of temporal entity B. Here A is shorter than B Examples of the inverse property: - The production of the scarab seal found in Poros in a context of LMIIIB (E12) starts after or with the start of Tutankhamun period (1332-1323 B.C) (E4). [The scarab stamp seal found in Poros was associated with finds dated to the LMIIIB period. The seal is dated to the Tutankhamun period or later because it belongs to the scarabs of type “nh.s n Jmn”: During Akhenaten period, the production of this type of scarab seal stopped (the name of Amun is not referred to during his reign). Therefore, the scarab cannot have been produced before the Tutankhamun period and is probably a later production] (Karetsou, 2000) - The production of the cylindrical seal of the first Dynasty of Babylon found in Tholos B in Platanos (E12) starts after or with the start of the Hammurabi period of the kingdom (E4). [Of the cylindrical …
domain: E2 Temporal Entity
label: P175 commence après ou au moment du début de @fr
range: E2 Temporal Entity
sub property of: P174 ends after the start of
notation: P175i

E7 Activity
type: Class
type: NamedIndividual
comment: Scope note: This class comprises actions intentionally carried out by instances of E39 Actor that result in changes of state in the cultural, social, or physical systems documented. This notion includes complex, composite, and long-lasting actions such as the building of a settlement or a war, as well as simple, short-lived actions such as the opening of a door. Examples: - the Battle of Stalingrad (Hoyt, 1993) - the Yalta Conference (Harbutt, 2010) - my birthday celebration 28-6-1995 - the writing of “Faust” by Goethe (E65) (Williams, 2020) - the formation of the Bauhaus 1919 (E66) (Droste, 2006) - the people of Iraq giving the name ‘Quyunjig’ to the place identified by the TGN as ‘7017998’ - Kira Weber working in glass art from 1984 to 1993 - Kira Weber working in oil and pastel painting from 1993 In First Order Logic: - E7(x) ⇒ E5(x)
label: E7 Activité @fr
label: E7 Atividade @pt
label: E7 Handlung @de
label: E7 Δράση @el
label: E7 Деятельность @ru
label: E7 活动 @zh
subclass of: E5 Event
subclass of: Restriction
  on property: P14 carried out by
  some values from: E39 Actor
notation: E7

P17 was motivated by
type: ObjectProperty
type: NamedIndividual
comment: Quantification: many to many (0,n:0,n) Scope note: This property describes an item or items that are regarded as a reason for carrying out the instance of E7 Activity. For example, the discovery of a large hoard of treasure may call for a celebration, an order from headquarters can start a military manoeuvre. Examples: - The resignation of the chief executive (E7) was motivated by the collapse of SwissAir (E68). - The coronation of Elizabeth II (E7) was motivated by the death of George VI (E69). (Strong, 2005) In First Order Logic: - P17(x,y) ⇒ E7(x) - P17(x,y) ⇒ E1(y) - P17(x,y) ⇒ P15(x,y)
domain: E7 Activity
label: P17 a été motivé par @fr
label: P17 foi motivado por @pt
label: P17 wurde angeregt durch @de
label: P17 είχε ως αφορμή @el
label: P17 был обусловлен посредством @ru
label: P17 被促动 @zh
range: E1 CRM Entity
sub property of: P15 was influenced by
inverse of: P17 motivated
notation: P17

E41 Appellation
type: Class
type: NamedIndividual
comment: Scope note: This class comprises all signs, either meaningful or not, or arrangements of signs following a specific syntax, that are used or can be used to refer to and identify a specific instance of some class within a certain context. Instances of E41 Appellation do not identify things by their meaning, even if they happen to have one, but by convention, tradition, or agreement. Instances of E41 Appellation are cultural constructs; as such, they have a context, a history, and a use in time and space by some group of users. A given instance of E41 Appellation can have alternative forms, i.e. other instances of E41 Appellation that are regarded as equivalent, regardless of the thing it denotes. Different languages may use different appellations for the same thing, such as the names of major cities. Some appellations may be formulated using a valid noun phrase of a particular language. In these cases, the respective instances of E41 Appellation should also be declared as instances of E33 Linguistic Object. Then the language using the appellation can be declared with the property P72 has language: E56 Language. Instances of E41 Appellation may be used to identify any instance of E1 CRM Entity and sometimes are characteristic for instances of more specific subclasses of E1 CRM Entity, such as for instances of E52 Time-Span (for instance “dates”), E39 Actor, E53 Place or E28 Conceptual Object. Postal addresses and E-mail addresses are characteristic examples of identifiers used by services transporting things between clients. Even numerically expressed identifiers for extents in space or time are also regarded as instances of E41 Appellation, such as Gregorian dates or spatial coordinates, even though they allow for determining some time or location by a known procedure starting from a reference point and by virtue of that fact play a double role as instances of E59 Primitive Value. E41 Appellation should not be confused with the act of naming something. Cf. E15 Identi…
label: E41 Benennung @de
label: E41 Designação @pt
label: E41 Ονομασία @el
label: E41 Обозначение @ru
label: E41 称谓 @zh
subclass of: E90 Symbolic Object
notation: E41

P45 is incorporated in
type: ObjectProperty
type: NamedIndividual
comment: Quantification of the inverse property: many to many, necessary (1,n:0,n) Scope note of the inverse property: This property identifies the instances of E57 Materials of which an instance of E18 Physical Thing is composed. All physical things consist of physical materials. P45 consists of (is incorporated in) allows the different materials to be recorded. P45 consists of (is incorporated in) refers here to observed material as opposed to the consumed raw material. A material, such as a theoretical alloy, may not have any physical instances. Examples of the inverse property: - Silver cup 232 (E22) consists of silver (E57). (fictitious) In First Order Logic of the inverse property: - P45(x,y) ⇒ E18(x) - P45(x,y) ⇒ E57(y)
domain: E57 Material
label: P45 est inclus dans @fr
label: P45 está presente em @pt
label: P45 ist enthalten in @de
label: P45 είναι ενσωματωμένος/η/ο σε @el
label: P45 входит в состав @ru
label: P45 结合在 @zh
range: E18 Physical Thing
notation: P45i

P74 has current or former residence
type: ObjectProperty
type: NamedIndividual
comment: Quantification: many to many (0,n:0,n) Scope note: This property describes the current or former place of residence (an instance of E53 Place) of an instance of E39 Actor. The residence may be either the place where the actor resides, or a legally registered address of any kind. Examples: - Queen Elizabeth II (E39) has current or former residence Buckingham Palace (E53). (Robinson, 2000) In First Order Logic: - P74(x,y) ⇒ E39(x) - P74(x,y) ⇒ E53(y)
domain: E39 Actor
label: P74 a pour résidence actuelle ou antérieure @fr
label: P74 hat derzeitigen oder früheren Sitz @de
label: P74 reside ou residiu em @pt
label: P74 έχει ή είχε κατοικία @el
label: P74 имеет текущее или бывшее местожительства @ru
label: P74 有当前或曾经居住地 @zh
range: E53 Place
inverse of: P74 is current or former residence of
notation: P74

P188 is production tool for
type: ObjectProperty
type: NamedIndividual
comment: Quantification of the inverse property: many to many (0,n:0,n) Scope note of the inverse property: This property associates an instance of E99 Product Type with an instance of E19 Physical Object that is needed for the production of an instance of E18 Physical Thing. When the process of production is correctly executed in accordance with the plan and using the specified instance of E19 Physical Object, the resulting instance of E18 Physical Thing is considered an exemplar of this instance of E99 Product Type. The instance of E19 Physical Object may bear distinct features that are transformed into characteristic features of the resulting instance of E18 Physical Thing. Examples include models and moulds. Examples of the inverse property: - Volkswagen Type 11 (Beetle) (E99) requires production tool the luggage compartment lid mould for the Volkswagen Type 11 (Beetle) (E22). [See thumbnail image of the luggage compartment lid: https://upload.wikimedia.org/wikipedia/commons/thumb/b/b5/Volkswagen_Type_1_(Auto_classique_St._Lazare_'10).jpg/220px-Volkswagen_Type_1_(Auto_classique_St._Lazare_'10).jpg)] (Rieger, 2013) In First Order Logic of the inverse property: - P188(x,y) ⇒ E99(x) - P188(x,y) ⇒ E19(y)
domain: E19 Physical Object
label: P188 est l'outil de production de @fr
range: E99 Product Type
notation: P188i

E22 Human-Made Object
type: Class
type: NamedIndividual
comment: Scope note: This class comprises all persistent physical objects of any size that are purposely created by human activity and have physical boundaries that separate them completely in an objective way from other objects. The class also includes all aggregates of objects made for functional purposes of whatever kind, independent of physical coherence, such as a set of chessmen. Examples: - the Rosetta Stone (E22) - LNER Class A4 4468 Mallard [the World’s fastest steam locomotive, preserved at the National Railway Museum of York, UK] (Solomon, 2003) - the Portland Vase (Walker, 2004) In First Order Logic: - E22(x) ⇒ E19(x) - E22(x) ⇒ E24(x)
label: E22 Objet élaboré par l’humain @fr
subclass of: E19 Physical Object
subclass of: E24 Physical Human-Made Thing
notation: E22

P136 supported type creation
type: ObjectProperty
type: NamedIndividual
comment: Quantification of the inverse property: many to many (0,n:0,n) Scope note of the inverse property: This property identifies one or more instances of E1 CRM Entity that were used as evidence to declare a new instance of E55 Type. The examination of these items is often the only objective way to understand the precise characteristics of a new type. Such items should be deposited in a museum or similar institution for that reason. The taxonomic role renders the specific relationship of each item to the type, such as “holotype” or “original element”. Examples of the inverse property: - The taxon creation of the plant species ‘Serratula glauca Linné, 1753.’ (E83) was based on Object BM000576251 of the Clayton Herbarium (E20) in the taxonomic role original element (E55). (Blake, 1918) In First Order Logic of the inverse property: - P136(x,y) ⇒ E83(x) - P136(x,y) ⇒ E1(y) - P136(x,y,z) ⇒ [P136(x,y) ∧ E55(z)] - P136(x,y) ⇒ P15(x,y)
domain: E1 CRM Entity
label: P136 a fondé la création du type @fr
label: P136 belegte @de
label: P136 suportou a criação de tipo @pt
label: P136 υποστήριξε τη δημιουργία τύπου @el
label: P136 поддержал создание типа @ru
label: P136 支持类型创建 @zh
range: E83 Type Creation
sub property of: P15 influenced
notation: P136i

P130 shows features of
type: ObjectProperty
type: NamedIndividual
comment: Quantification: many to many (0,n:0,n) Scope note: This property generalises the notions of “copy of” and “similar to” into a directed relationship, where the domain expresses the derivative or influenced item and the range the source or influencing item, if such a direction can be established. The property can also be used to express similarity in cases that can be stated between two objects only, without historical knowledge about its reasons. The property expresses a symmetric relationship in case no direction of influence can be established either from evidence on the item itself or from historical knowledge. This holds in particular for siblings of a derivation process from a common source or non-causal cultural parallels, such as some weaving patterns. The P130.1 kind of similarity property of the P130 shows features of (features are also found on) property enables the relationship between the domain and the range to be further clarified, in the sense from domain to range, if applicable. For example, it may be expressed if both items are product “of the same mould”, or if two texts “contain identical paragraphs”. If the reason for similarity is a sort of derivation process, i.e. that the creator has used or had in mind the form of a particular thing during the creation or production, this process should be explicitly modelled. In these cases, P130 shows features of can be regarded as a shortcut of such a process. However, the current model does not contain any path specific enough to infer this property. Specializations of the CIDOC CRM may however be more explicit, for instance describing the use of moulds etc. This property is not transitive. This property is irreflexive. Examples: - Mary Lamb’s Cymbeline from Charles and Mary Lamb’s Tales from Shakespeare (E89) shows features of William Shakespeare’s Cymbeline (E89). (Carrington, 1954) - The audio recording of Dante Alighieri’s La divina commedia read by Enrico de Negri (E73) shows features of the text of D…
domain: E70 Thing
label: P130 apresenta características de @pt
label: P130 présente les caractéristiques de @fr
label: P130 zeigt Merkmale von @de
label: P130 παρουσιάζει χαρακτηριστικά του/της @el
label: P130 демонстрирует признаки @ru
label: P130 显示特征 @zh
range: E70 Thing
inverse of: P130 features are also found on
notation: P130

P152 has parent
type: ObjectProperty
type: NamedIndividual
comment: Quantification: many to many, necessary (2,n:0,n) Scope note: This property associates an instance of E21 Person with another instance of E21 Person who plays the role of the first instance’s parent, regardless of whether the relationship is biological parenthood, assumed or pretended biological parenthood or an equivalent legal status of rights and obligations obtained by a social or legal act. This property is, among others, a shortcut of the fully developed paths from E21 Person through P98i was born, E67 Birth, P96 by mother to E21 Person, and from E21 Person through P98i was born, E67 Birth, P97 from father to E21 Person. This property is not transitive. This property is irreflexive. Examples: - Gaius Octavius (E21) has parent Julius Caesar (E21). (Bleicken & Bell, 2015) - Steve Jobs (E21) has parent Joanne Simpson (E21). [Biological mother] (Isaacson, 2011) - Steve Jobs (E21) has parent Clara Jobs (E21). [Adoption mother] (Isaacson, 2011) In First Order Logic: - P152(x,y) ⇒ E21(x) - P152(x,y) ⇒ E21(y) - P152(x,y) ⇐ (∃z) [E67(z) ˄ P98i(x,z) ˄ P96(z,y)] - P152(x,y) ⇐ (∃z) [E67(z) ˄ P98i(x,z) ˄ P97(z,y)] - ¬P152(x,x)
domain: E21 Person
label: P152 a pour parent @fr
range: E21 Person
inverse of: P152 is parent of
notation: P152

E53 Place
type: Class
type: NamedIndividual
comment: Scope note: This class comprises extents in the natural space where people live, in particular on the surface of the Earth, in the pure sense of physics: independent from temporal phenomena and matter. They may serve describing the physical location of things or phenomena or other areas of interest. Geometrically, instances of E53 Place constitute single contiguous areas or a finite aggregation of disjoint areas in space which are each individually contiguous. They may have fuzzy boundaries. The instances of E53 Place are usually determined by reference to the position of “immobile” objects such as buildings, cities, mountains, rivers, or dedicated geodetic marks, but may also be determined by reference to mobile objects. A Place can be determined by combining a frame of reference and a location with respect to this frame. It is sometimes argued that instances of E53 Place are best identified by global coordinates or absolute reference systems. However, relative references are often more relevant in the context of cultural documentation and tend to be more precise. In particular, people are often interested in position in relation to large, mobile objects, such as ships. For example, the Place at which Nelson died is known with reference to a large mobile object, i.e. H.M.S Victory. A resolution of this Place in terms of absolute coordinates would require knowledge of the movements of the vessel and the precise time of death, either of which may be revised, and the result would lack historical and cultural relevance. Any instance of E18 Physical Thing can serve as a frame of reference for an instance of E53 Place. This may be documented using the property P157 is at rest relative to (provides reference space for). Examples: - the extent of the UK in the year 2003 - the position of the hallmark on the inside of my wedding ring (fictitious) - the place referred to in the phrase: “Fish collected at three miles north of the confluence of the Arve and the Rhone” - here -…
label: E53 Lieu @fr
label: E53 Local @pt
label: E53 Ort @de
label: E53 Τόπος @el
label: E53 Место @ru
label: E53 地点 @zh
subclass of: E1 CRM Entity
subclass of: Restriction
  max cardinality: 1
  on property: P59 is located on or within
notation: E53

P95 was formed by
type: ObjectProperty
type: NamedIndividual
comment: Quantification of the inverse property: one to many, necessary, dependent (1,n:1,1) Scope note of the inverse property: This property associates the instance of E66 Formation with the instance of E74 Group that it founded. Examples of the inverse property: - The formation of the CIDOC CRM SIG at the August 2000 CIDOC Board meeting (E66) has formed the CIDOC CRM Special Interest Group (E74). In First Order Logic of the inverse property: - P95(x,y) ⇒ E66(x) - P95(x,y) ⇒ E74(y) - P95(x,y) ⇒ P92(x,y)
domain: E74 Group
label: P95 a été fondé par @fr
label: P95 foi formado por @pt
label: P95 wurde gebildet von @de
label: P95 σχηματίστηκε από @el
label: P95 была сформирована посредством @ru
label: P95 被组成 @zh
range: E66 Formation
sub property of: P92 was brought into existence by
notation: P95i

P140 was attributed by
type: ObjectProperty
type: NamedIndividual
comment: Quantification of the inverse property: many to many (0,n:0,n) Scope note of the inverse property: This property associates an instance of E13 Attribute Assignment with the instance of E1 CRM Entity about which it made an attribution. The instance of E1 CRM Entity plays the role of the domain of the attribution. The kind of attribution made should be documented using P177 assigned property of type (is type of property assigned). Examples of the inverse property: - The Current Ownership Assessment of Martin Doerr’s silver cup February 1997 (E13) assigned attribute to Martin Doerr’s silver cup (E22). (fictitious) - The Identifier Assignment on 1(st) June 1997 of the silver cup donated by Martin Doerr (E15) assigned attribute to silver cup 232 (E22). (fictitious) - The examination of MS Sinai Greek 418 (E13) assigned attribute to MS Sinai Greek 418 (E22). (Honey and Pickwoad, 2010) In First Order Logic of the inverse property: - P140(x,y) ⇒ E13(x) - P140(x,y) ⇒ E1(y)
domain: E1 CRM Entity
label: P140 a reçu l’attribut par @fr
label: P140 bekam Merkmal zugewiesen durch @de
label: P140 foi atribuído por @pt
label: P140 χαρακτηρίστηκε από @el
label: P140 получил атрибут посредством @ru
label: P140 接受属性 @zh
range: E13 Attribute Assignment
notation: P140i

P104 applies to
type: ObjectProperty
type: NamedIndividual
comment: Quantification of the inverse property: many to many (0,n:0,n) Scope note of the inverse property: This property links a particular instance of E72 Legal Object to the instances of E30 Right to which it is subject. The Right is held by an instance of E39 Actor as described by P75 possesses (is possessed by). Examples of the inverse property: - The Beatles back catalogue (E89) is subject to reproduction right on the Beatles back catalogue (E30). (Raga, 2016) In First Order Logic of the inverse property: - P104(x,y) ⇒ E72(x) - P104(x,y) ⇒ E30(y)
domain: E30 Right
label: P104 findet Anwendung auf @de
label: P104 se aplicam à @pt
label: P104 s’applique à @fr
label: P104 ισχύει για @el
label: P104 применяется к @ru
label: P104 适用于 @zh
range: E72 Legal Object
notation: P104i

P138 has representation
type: ObjectProperty
type: NamedIndividual
comment: Quantification of the inverse property: many to many (0,n:0,n) Scope note of the inverse property: This property establishes the relationship between an instance of E36 Visual Item and the instance of E1 CRM Entity that it visually represents. Any entity may be represented visually. This property is part of the fully developed path from E24 Physical Human-Made Thing through P65 shows visual item (is shown by), E36 Visual Item, P138 represents (has representation) to E1 CRM Entity, which is shortcut by P62 depicts (is depicted by). P138.1 mode of representation allows the nature of the representation to be refined. This property is also used for the relationship between an original and a digitisation of the original by the use of techniques such as digital photography, flatbed or infrared scanning. Digitisation is here seen as a process with a mechanical, causal component rendering the spatial distribution of structural and optical properties of the original and does not necessarily include any visual similarity identifiable by human observation. Examples of the inverse property: - The digital file found at https://www.emunch.no/N/full/No-MM_N0001-01.jpg (E36) represents page 1 of Edward Munch's manuscript MM N 1, Munch-museet (E22) mode of representation Digitisation (E55). - The 3D model VAM_A.200-1946_trace_1M.ply (E73) represents Victoria & Albert Museum’s Madonna and child sculpture (visual work) A.200-1946 (E22) mode of representation 3D surface (E55). In First Order Logic of the inverse property: - P138(x,y) ⇒ E36(x) - P138(x,y) ⇒ E1(y) - P138(x,y,z) ⇒ [P138(x,y) ∧ E55(z)] - P138(x,y) ⇒ P67(x,y)
domain: E1 CRM Entity
label: P138 est représenté par @fr
label: P138 tem representação @pt
label: P138 wird dargestellt durch @de
label: P138 παριστάνεται από @el
label: P138 имеет представление @ru
label: P138 有描绘 @zh
range: E36 Visual Item
sub property of: P67 is referred to by
notation: P138i

P134 was continued by
type: ObjectProperty
type: NamedIndividual
comment: Quantification of the inverse property: many to many (0,n:0,n) Scope note of the inverse property: This property associates two instances of E7 Activity, where the domain is considered as an intentional continuation of the range. A continuation of an activity may happen when the continued activity is still ongoing or after the continued activity has completely ended. The continuing activity may have started already before it decided to continue the other one. Continuation implies a coherence of intentions and outcomes of the involved activities. This property is not transitive. This property is asymmetric. Examples of the inverse property: - The construction of the Kölner Dom (Cologne Cathedral), abandoned in the 15(th) century (E7), was continued by construction in the 19(th) century (E7). [The construction in the 19(th) century adapted the initial plans so as to preserve the intended appearance.] (Wolff, 1999) In First Order Logic of the inverse property: - P134(x,y) ⇒ E7(x) - P134(x,y)⇒ E7(y) - P134(x,y) ⇒ P15(x,y) - P134(x,y) ⇒ P176i(x,y) - P134(x,y) ⇒ ¬P134(y,x)
domain: E7 Activity
label: P134 a été continué par @fr
label: P134 foi continuada por @pt
label: P134 wurde fortgesetzt durch @de
label: P134 συνεχίστηκε από @el
label: P134 был продолжен @ru
label: P134 被继续 @zh
range: E7 Activity
sub property of: P15 influenced
sub property of: P176 starts before the start of
notation: P134i

E70 Thing
type: Class
type: NamedIndividual
comment: Scope note: This general class comprises discrete, identifiable, instances of E77 Persistent Item that are documented as single units, that either consist of matter or depend on being carried by matter and are characterized by relative stability. They may be intellectual products or physical things. They may, for instance, have a solid physical form, an electronic encoding, or they may be a logical concept or structure. Examples: - my photograph collection (E78) (fictitious) - the bottle of milk in my refrigerator (E22) (fictitious) - the Riss A1 plan of the Straßburger Münster (French: Cathédrale Notre-Dame de Strasbourg) (E29) (Liess, R., 1985) - the thing on the top of Otto Hahn’s desk (E19) - the form of the no-smoking sign (E36) - the cave of Dirou, Mani, Greece (E26) (Psimenos, 2005) In First Order Logic: - E70(x) ⇒ E77(x)
label: E70 Chose @fr
label: E70 Coisa @pt
label: E70 Sache @de
label: E70 Πράγμα @el
label: E70 Вещь @ru
label: E70 事物 @zh
subclass of: E77 Persistent Item
notation: E70

E37 Mark
type: Class
type: NamedIndividual
comment: Scope note: This class comprises symbols, signs, signatures, or short texts applied to instances of E24 Physical Human-Made Thing by arbitrary techniques, often in order to indicate such things as creator, owner, dedications, purpose, or to communicate information generally. Instances of E37 Mark do not represent the actual image of a mark, but the abstract ideal (or archetype) as used for codification in reference documents forming cultural documentation. This class specifically excludes features that have no semantic significance, such as scratches or tool marks. These should be documented as instances of E25 Human-Made Feature. Examples: - Minoan double axe mark (Lowe Fri, 2011) - © - ☺ In First Order Logic: - E37(x) ⇒ E36(x)
label: E37 Marca @pt
label: E37 Marke @de
label: E37 Marque @fr
label: E37 Σήμανση @el
label: E37 Пометка @ru
label: E37 标记 @zh
subclass of: E36 Visual Item
notation: E37

E67 Birth
type: Class
type: NamedIndividual
comment: Scope note: This class comprises the births of human beings. E67 Birth is a biological event focussing on the context of people coming into life. (E63 Beginning of Existence comprises the coming into life of any living being.) Twins, triplets, etc. are brought into life by the same instance of E67 Birth. The introduction of the E67 Birth event as a documentation element allows the description of a range of family relationships in a simple model. Suitable extensions may describe more details and the complexity of motherhood since the advent of modern medicine. In this model, the biological father is not seen as a necessary participant in the E67 Birth. Examples: - the birth of Alexander the Great (Stoneman, 2004) In First Order Logic: - E67(x) ⇒ E63(x)
label: E67 Geburt @de
label: E67 Naissance @fr
label: E67 Nascimento @pt
label: E67 Γέννηση @el
label: E67 Рождение @ru
label: E67 出生 @zh
subclass of: E63 Beginning of Existence
subclass of: Restriction
  on property: P96 by mother
  some values from: E21 Person
subclass of: Restriction
  on property: P97 from father
  some values from: E21 Person
subclass of: Restriction
  on property: P98 brought into life
  some values from: E21 Person
notation: E67

P68 use foreseen by
type: ObjectProperty
type: NamedIndividual
comment: Quantification of the inverse property: many to many (0,n:0,n) Scope note of the inverse property: This property identifies an instance of E57 Material foreseen to be used by an instance of E29 Design or Procedure. E29 Designs and procedures commonly foresee the use of particular instances of E57 Material. The fabrication of adobe bricks, for example, requires straw, clay and water. This property enables this to be documented. This property is not intended for the documentation of instances of E57 Materials that were used on a particular occasion when an instance of E29 Design or Procedure was executed. Examples of the inverse property: - The procedure for soda glass manufacture (E29) foresees use of soda (E57). (Brooks, 1973) In First Order Logic of the inverse property: - P68(x,y) ⇒ E29(x) - P68(x,y) ⇒ E57(y) - P68(x,y) ⇒ P67(x,y)
domain: E57 Material
label: P68 usage prévu de @fr
label: P68 vorgesehen für Gebrauch durch defined @de
label: P68 é empregado por @pt
label: P68 συνήθως χρησιμοποιείται από @el
label: P68 обычно используется посредством @ru
label: P68 被预知使用 @zh
range: E29 Design or Procedure
sub property of: P67 is referred to by
notation: P68i

P65 is shown by
type: ObjectProperty
type: NamedIndividual
comment: Quantification of the inverse property: many to many (0,n:0,n) Scope note of the inverse property: This property documents an instance of E36 Visual Item shown by an instance of E24 Physical Human-Made Thing. This property is similar to P62 depicts (is depicted by) in that it associates an instance of E24 Physical Human-Made Thing with a visual representation. However, P65 shows visual item (is shown by) differs from the P62 depicts (is depicted by) property in that it makes no claims about what the instance of E36 Visual Item is deemed to represent. An instance of E36 Visual Item identifies a recognisable image or visual symbol, regardless of what this image may or may not represent. For example, all recent British coins bear a portrait of Queen Elizabeth II, a fact that is correctly documented using P62 depicts (is depicted by). Different portraits have been used at different periods, however. P65 shows visual item (is shown by) can be used to refer to a particular portrait. P65 shows visual item (is shown by) may also be used for Visual Items such as signs, marks and symbols, for example the 'Maltese Cross' or the 'copyright symbol’ that have no particular representational content. This property is part of the fully developed path E24 Physical Human-Made Thing, P65 shows visual item, E36 Visual Item, P138 represents to E1 CRM Entity which is shortcut by, P62 depicts (is depicted by). Examples of the inverse property: - My T-Shirt (E22) shows visual item Mona Lisa (E36). (fictitious) In First Order Logic of the inverse property: - P65(x,y) ⇒ E24(x) - P65(x,y) ⇒ E36(y) - P65(x,y) ⇒ P128(x,y)
domain: E36 Visual Item
label: P65 est représenté par @fr
label: P65 wird gezeigt durch @de
label: P65 é apresentado por @pt
label: P65 εμφανίζεται σε @el
label: P65 показан посредством @ru
label: P65 被展示 @zh
range: E24 Physical Human-Made Thing
sub property of: P128 is carried by
notation: P65i

P173 ends after or with the start of
type: ObjectProperty
type: NamedIndividual
comment: Quantification of the inverse property: many to many (0,n:0,n) Scope note of the inverse property: This property specifies that the temporal extent of the domain instance A of E2 Temporal Entity starts before or simultaneously with the end of the temporal extent of the range instance B of E2 Temporal Entity. In other words, if A = [A(start), A(end)] and B = [B(start), B(end)], it means A(start) ≤ B(end) is true. This property is part of the set of temporal primitives P173 – P176, P182 – P185. This property corresponds to the disjunction (logical OR) of the following Allen temporal relations (Allen, 1983): {before, meets, met-by, overlaps, starts, started-by, contains, finishes, finished-by, equals, during, overlapped by}. This property is not transitive. https://cidoc-crm.org/html/version_images/images_7.1.3/image_01.png Figure 8: Temporal entity A starts before or with the end of temporal entity B. Here A is longer than B https://cidoc-crm.org/html/version_images/images_7.1.3/image_02.png Figure 9: Temporal entity A starts before or with the end of temporal entity B. Here A is shorter than B Examples of the inverse property: - The legendary run from Marathon to Athens 490BC (E7) starts before or with the end of The Battle of Marathon 490BC (E7). - LMIIB (E4) ends after or with the start of the Tutankhamun period (1332-1323 B.C.E.) (E4). [Evidence for this is provided by the scarab seal found at Poros in a context of LMIIB. The scarab belongs to the type “nh.s n Jmn”. During the Akhenaten period he production of these scarab seals stopped (the name of Amun is not referred to during his reign). So the scarab could not have been produced before the Tutankhamun period and is probably a later production.] (Karetsou, 2000) In First Order Logic of the inverse property: - P173(x,y) ⇒ E2(x) - P173(x,y) ⇒ E2(y)
domain: E2 Temporal Entity
label: P173 se termine après ou au moment du début de @fr
range: E2 Temporal Entity
notation: P173i

P75 is possessed by
type: ObjectProperty
type: NamedIndividual
comment: Quantification of the inverse property: many to many (0,n:0,n) Scope note of the inverse property: This property associates an instance of E39 Actor to an instance of E30 Right over which the actor holds or has held a legal claim. Examples of the inverse property: - Michael Jackson (E21) possesses intellectual property rights on the Beatles’ back catalogue (E30). (Raga, 2016) In First Order Logic of the inverse property: - P75(x,y) ⇒ E39(x) - P75(x,y) ⇒ E30(y)
domain: E30 Right
label: P75 est possédé par @fr
label: P75 sind im Besitz von @de
label: P75 são detidos por @pt
label: P75 κατέχεται από @el
label: P75 принадлежит @ru
label: P75 被拥有 @zh
range: E39 Actor
notation: P75i

P7 witnessed
type: ObjectProperty
type: NamedIndividual
comment: Quantification of the inverse property: many to many, necessary (1,n:0,n) Scope note of the inverse property: This property describes the spatial location of an instance of E4 Period. The related instance of E53 Place should be seen as a wider approximation of the geometric area within which the phenomena that characterise the period in question occurred, see below. P7 took place at (witnessed) does not convey any meaning other than spatial positioning (frequently on the surface of the earth). For example, the period “Révolution française” can be said to have taken place in “France in 1789”; the “Victorian” period may be said to have taken place in “Britain from 1837-1901” and its colonies, as well as other parts of Europe and North America. An instance of E4 Period can take place at multiple non-contiguous, non-overlapping locations. Any place where something happened includes the spatial projection of the happening given in the same geometric reference system. For instance, HMS Victory, as place of Lord Nelson's dying, includes the location of his body relative to the hull of HMS Victory at his time of death as the most precise location of his death. By the definition of P161 has spatial projection, an instance of E4 Period takes place on all its spatial projections to respective reference systems, that is, instances of E53 Place. Therefore, this property implies the more fully developed path from E4 Period through P161 has spatial projection, E53 Place, P89 falls within to E53 Place, where both places are defined in the same geometric reference system. The relation between an instance of E53 Place and its reference system can conveniently be documented via the property P157 is at rest relative to (provides reference space for). Something that has happened at a given place can also be considered to have happened at a smaller place within it: for example, it is reasonable to say Caesar’s murder took place in Rome, but also on the Forum Romanum, and more precisely i…
domain: E53 Place
label: P7 a été témoin de @fr
label: P7 bezeugte @de
label: P7 testemunhou @pt
label: P7 υπήρξε τόπος του @el
label: P7 был местом совершения @ru
label: P7 发生过 @zh
range: E4 Period
notation: P7i

P10 falls within
type: ObjectProperty
type: TransitiveProperty
type: NamedIndividual
comment: Quantification: many to many, necessary, dependent (1,n:1,n) Scope note: This property associates an instance of E92 Spacetime Volume with another instance of E92 Spacetime Volume that falls within the latter. In other words, all points in the former are also points in the latter. This property is transitive and reflexive. Examples: - The Great Plague (E4) falls within The Gothic period (E4). (Porter, 2009) In First Order Logic: - P10(x,y) ⇒ E92(x) - P10(x,y) ⇒ E92(y) - P10(x,y) ⇒ P132(x,y) - P10(x,y) ∧ P10(y,z)] ⇒ P10(x,z) - P10(x,x)
domain: E92 Spacetime Volume
label: P10 está contido em @pt
label: P10 fällt in @de
label: P10 s’insère dans @fr
label: P10 εμπίπτει @el
label: P10 находится в пределах @ru
label: P10 属于 @zh
range: E92 Spacetime Volume
sub property of: P132 spatiotemporally overlaps with
inverse of: P10 contains
notation: P10

E17 Type Assignment
type: Class
type: NamedIndividual
comment: Scope note: This class comprises the actions of classifying items of whatever kind. Such items include objects, specimens, people, actions, and concepts. This class allows for the documentation of the context of classification acts in cases where the value of the classification depends on the personal opinion of the classifier, and the date that the classification was made. This class also encompasses the notion of “determination,” i.e. the systematic and molecular identification of a specimen in biology. Examples: - the first classification of object GE34604 as Lamentation cloth at the Museum Benaki, Athens - the determination of a cactus in Martin Doerr’s garden as Cereus hildmannianus K.Schum., July 2003 In First Order Logic: - E17(x) ⇒ E13(x)
label: E17 Assignation de type @fr
label: E17 Atribuição de Tipo @pt
label: E17 Typuszuweisung @de
label: E17 Απόδοση Τύπου @el
label: E17 Присвоение Типа @ru
label: E17 类型赋值 @zh
subclass of: E13 Attribute Assignment
subclass of: Restriction
  on property: P42 assigned
  some values from: E55 Type
subclass of: Restriction
  cardinality: 1
  on property: P41 classified
notation: E17

P110 augmented
type: ObjectProperty
type: NamedIndividual
comment: Quantification: many to many, necessary (1,n:0,n) Scope note: This property identifies the instance of E18 Physical Thing that is added to (augmented) in an instance of E79 Part Addition. Although an instance of E79 Part Addition event normally concerns only one instance of E18 Physical Thing, it is possible to imagine circumstances under which more than one item might be added to (augmented). For example, the artist Jackson Pollock trailing paint onto multiple canvasses. Examples: - The final nail-insertion Event (E79) augmented Coffin of George VI (E22). (https://www.rct.uk/collection/2000811/the-coffin-of-king-george-vi-during-the-lying-in-state) - The attachment of the bronze hand of the Alpi Marittime sculpture (E79) augmented the tree of the Alpi Marittime sculpture (E20). [https://giuseppepenone.com/en/words/maritime-alps] (Mangini, 2010) In First Order Logic: - P110(x,y) ⇒ E79(x) - P110(x,y) ⇒ E18(y) - P110(x,y) ⇒ P31(x,y)
domain: E79 Part Addition
label: P110 a augmenté @fr
label: P110 aumentou @pt
label: P110 erweiterte @de
label: P110 επαύξησε @el
label: P110 увеличил @ru
label: P110 增强了 @zh
range: E18 Physical Thing
sub property of: P31 has modified
inverse of: P110 was augmented by
notation: P110

P148 has component
type: ObjectProperty
type: TransitiveProperty
type: NamedIndividual
comment: Quantification: many to many (0,n:0,n) Scope note: This property associates an instance of E89 Propositional Object with a structural part of it that is by itself an instance of E89 Propositional Object. This property is transitive. This property is asymmetric. Examples: - Dante’s “Divine Comedy” (E89) has component Dante’s “Hell” (E89). (Alighieri, 1956) In First Order Logic: - P148(x,y) ⇒ E89(x) - P148(x,y) ⇒ E89(y) - [P148(x,y) ∧ P148(y,z)] ⇒ P148(x,z) - P148(x,y) ⇒ ¬P148(y,x)
domain: E89 Propositional Object
label: P148 a pour composant @fr
label: P148 hat Bestandteil @de
label: P148 有组件 @zh
range: E89 Propositional Object
inverse of: P148 is component of
notation: P148

P191 was duration of
type: ObjectProperty
type: NamedIndividual
comment: Quantification of the inverse property: one to one (1,1:1,1) Scope note of the inverse property: This property describes the length of time covered by an instance of E52 Time-Span. It allows an instance of E52 Time-Span to be associated with an instance of E54 Dimension representing duration independent from the actual beginning and end. Indeterminacy of the duration value can be expressed by assigning a numerical interval to the property P90 has value of E54 Dimension. Examples of the inverse property: - The time-span of the Battle of Issos 333 B.C.E. (E52) had duration Battle of Issos duration (E54). (Howard, 2012) In First Order Logic of the inverse property: - P191(x,y) ⇒ E52(x) - P191(x,y) ⇒ E54(y)
domain: E54 Dimension
label: P191 était la durée de @fr
range: E52 Time-Span
notation: P191i

E18 Physical Thing
type: Class
type: NamedIndividual
comment: Scope note: This class comprises all persistent physical items with a relatively stable form, human-made or natural. Depending on the existence of natural boundaries of such things, the CIDOC CRM distinguishes the instances of E19 Physical Object from instances of E26 Physical Feature, such as holes, rivers, pieces of land, etc. Most instances of E19 Physical Object can be moved (if not too heavy), whereas features are integral to the surrounding matter. An instance of E18 Physical Thing occupies not only a particular geometric space at any instant of its existence, but in the course of its existence it also forms a trajectory through spacetime, which occupies a real, that is phenomenal, volume in spacetime. We include in the occupied space the space filled by the matter of the physical thing and all its inner spaces, such as the interior of a box. For the purpose of more detailed descriptions of the presence of an instance of E18 Physical Thing in space and time it can be associated with its specific instance of E92 Spacetime Volume by the property P196 defines (is defined by). The CIDOC CRM is generally not concerned with amounts of matter in fluid or gaseous states, as long as they are not confined in an identifiable way for an identifiable minimal time-span. Examples: - the Cullinan Diamond (E19) (Scarratt and Shor, 2006) - the cave “Ideon Andron” in Crete (E26) (Smith, 1844-49) - the Mona Lisa (E22) (Mohen, 2006) In First Order Logic: - E18(x) ⇒ E72(x)
label: E18 Chose matérielle @fr
label: E18 Coisa Material @pt
label: E18 Materielles @de
label: E18 Υλικό Πράγμα @el
label: E18 Физическая Вещь @ru
label: E18 实物 @zh
subclass of: E72 Legal Object
subclass of: Restriction
  on property: P45 consists of
  some values from: E57 Material
subclass of: Restriction
  on property: P53 has former or current location
  some values from: E53 Place
subclass of: Restriction
  max cardinality: 1
  on property: P13 was destroyed by
disjoint with: E28 Conceptual Object
notation: E18

P138 represents
type: ObjectProperty
type: NamedIndividual
comment: Quantification: many to many (0,n:0,n) Scope note: This property establishes the relationship between an instance of E36 Visual Item and the instance of E1 CRM Entity that it visually represents. Any entity may be represented visually. This property is part of the fully developed path from E24 Physical Human-Made Thing through P65 shows visual item (is shown by), E36 Visual Item, P138 represents (has representation) to E1 CRM Entity, which is shortcut by P62 depicts (is depicted by). P138.1 mode of representation allows the nature of the representation to be refined. This property is also used for the relationship between an original and a digitisation of the original by the use of techniques such as digital photography, flatbed or infrared scanning. Digitisation is here seen as a process with a mechanical, causal component rendering the spatial distribution of structural and optical properties of the original and does not necessarily include any visual similarity identifiable by human observation. Examples: - The digital file found at https://www.emunch.no/N/full/No-MM_N0001-01.jpg (E36) represents page 1 of Edward Munch's manuscript MM N 1, Munch-museet (E22) mode of representation Digitisation (E55). - The 3D model VAM_A.200-1946_trace_1M.ply (E73) represents Victoria & Albert Museum’s Madonna and child sculpture (visual work) A.200-1946 (E22) mode of representation 3D surface (E55). Properties: - P138.1 mode of representation: E55 Type In First Order Logic: - P138(x,y) ⇒ E36(x) - P138(x,y) ⇒ E1(y) - P138(x,y,z) ⇒ [P138(x,y) ∧ E55(z)] - P138(x,y) ⇒ P67(x,y)
domain: E36 Visual Item
label: P138 representa @pt
label: P138 représente @fr
label: P138 stellt dar @de
label: P138 παριστάνει @el
label: P138 представляет @ru
label: P138 描绘 @zh
range: E1 CRM Entity
sub property of: P67 refers to
inverse of: P138 has representation
notation: P138

P75 possesses
type: ObjectProperty
type: NamedIndividual
comment: Quantification: many to many (0,n:0,n) Scope note: This property associates an instance of E39 Actor to an instance of E30 Right over which the actor holds or has held a legal claim. Examples: - Michael Jackson (E21) possesses intellectual property rights on the Beatles’ back catalogue (E30). (Raga, 2016) In First Order Logic: - P75(x,y) ⇒ E39(x) - P75(x,y) ⇒ E30(y)
domain: E39 Actor
label: P75 besitzt @de
label: P75 possède @fr
label: P75 é detentor de @pt
label: P75 κατέχει @el
label: P75 владеет @ru
label: P75 拥有 @zh
range: E30 Right
inverse of: P75 is possessed by
notation: P75

P125 used object of type
type: ObjectProperty
type: NamedIndividual
comment: Quantification: many to many (0,n:0,n) Scope note: This property associates an instance of E7 Activity to an instance of E55 Type, which classifies an instance of E70 Thing used in an instance of E7 Activity, when the specific instance is either unknown or not of interest, such as use of “a hammer”. This property is a shortcut of the more fully developed path from E7 Activity through P16 used specific object, E70 Thing, P2 has type, to E55 Type. Examples: - The English archers’ activity in the Battle of Agincourt (E7) used object of type long bow (E55). (Curry, 2015) In First Order Logic: - P125(x,y) ⇒ E7(x) - P125(x,y) ⇒ E55(y) - P125(x,y) ⇔ (∃z) [E70(z) ∧ P16(x,z) ∧ P2(z,y)]
domain: E7 Activity
label: P125 a mobilisé l’objet du type @fr
label: P125 benutzte Objekt des Typus @de
label: P125 usou objeto do tipo @pt
label: P125 χρησιμοποίησε αντικείμενο τύπου @el
label: P125 использовал объект типа @ru
label: P125 使用对象类型 @zh
range: E55 Type
inverse of: P125 was type of object used in
notation: P125

P98 brought into life
type: ObjectProperty
type: NamedIndividual
comment: Quantification: one to many, dependent (0,n:1,1) Scope note: This property links an instance of E67 Birth event to an instance of E21 Person in the role of offspring. Twins, triplets etc. are brought into life by the same instance of E67 Birth. This is not intended for use with general Natural History material, only people. There is no explicit method for modelling conception and gestation except by using extensions. Examples: - The Birth of Queen Elizabeth II (E67) brought into life Queen Elizabeth II (E21). (Parker, 2002) In First Order Logic: - P98(x,y) ⇒ E67(x) - P98(x,y) ⇒ E21(y) - P98(x,y) ⇒ P92(x,y)
domain: E67 Birth
label: P98 a donné vie à @fr
label: P98 brachte zur Welt @de
label: P98 trouxe à vida @pt
label: P98 έφερε στη ζωή @el
label: P98 породил @ru
label: P98 诞生了 @zh
range: E21 Person
sub property of: P92 brought into existence
inverse of: P98 was born
notation: P98

P135 was created by
type: ObjectProperty
type: NamedIndividual
comment: Quantification of the inverse property: one to many, necessary (1,n:0,1) Scope note of the inverse property: This property identifies the instance of E55 Type, which is created in an instance of E83 Type Creation activity. Examples of the inverse property: - The description of a new ribbon worm species by Bürger (E83) created type ‘Lineus kennelii’ (E55). (Bürger, 1892) In First Order Logic of the inverse property: - P135(x,y) ⇒ E83(x) - P135(x,y) ⇒ E55(y) - P135(x,y) ⇒ P94(x,y)
domain: E55 Type
label: P135 a été créé par @fr
label: P135 foi criado por @pt
label: P135 wurde geschaffen durch @de
label: P135 δημιουργήθηκε από @el
label: P135 был создан посредством @ru
label: P135 被创建 @zh
range: E83 Type Creation
sub property of: P94 was created by
notation: P135i

E87 Curation Activity
type: Class
type: NamedIndividual
comment: Scope note: This class comprises the activities that contribute to the management and the preservation and evolution of instances of E78 Curated Holding, following an implicit or explicit curation plan. It specializes the notion of activity into the curation of a collection and allows the history of curation to be recorded. Items are accumulated and organized following criteria such as subject, chronological period, material type, style of art, etc., and can be added or removed from an instance of E78 Curated Holding for a specific purpose and/or audience. The initial aggregation of items to form a collection is regarded as an instance of E12 Production Event, while the activities of evolving, preserving, and promoting a collection are regarded as instances of E87 Curation Activity. Examples: - the curation of Mikael Heggelund Foslie’s coralline red algae Herbarium 1876 to 1909 (when Foslie died), now at the Museum of Natural History and Archaeology, Norway (Woelkerling et al., 2005) In First Order Logic: - E87(x) ⇒ E7(x)
label: E87 Activité curatoriale @fr
label: E87 Kuratorische Tätigkeit @de
label: E87 管理 @zh
subclass of: E7 Activity
subclass of: Restriction
  on property: P147 curated
  some values from: E78 Curated Holding
notation: E87

P19 was made for
type: ObjectProperty
type: NamedIndividual
comment: Quantification of the inverse property: many to many (0,n:0,n) Scope note of the inverse property: This property relates an instance of E7 Activity with instances of E71 Human-Made Thing, created specifically for use in the activity. This is distinct from the intended use of an item in some general type of activity such as the book of common prayer which was intended for use in Church of England services (see P101 had as general use (was use of)). Examples of the inverse property: - Lady Diana Spencer’s wedding dress (E71) was made for Wedding of Prince Charles and Lady Diana Spencer (E7) mode of use To Be Worn (E55). (Daly, 1981) In First Order Logic of the inverse property: - P19(x,y) ⇒ E7(x) - P19(x,y) ⇒ E71(y) - P19(x,y,z) ⇒ [P19(x,y) ∧ E55(z)]
domain: E71 Human-Made Thing
label: P19 a été élaboré pour @fr
label: P19 foi feito para @pt
label: P19 wurde hergestellt für @de
label: P19 έγινε για @el
label: P19 был создан для @ru
label: P19 用于 @zh
range: E7 Activity
notation: P19i

P37 assigned
type: ObjectProperty
type: NamedIndividual
comment: Quantification: many to many (0,n:0,n) Scope note: This property records the identifier that was assigned to an item in an instance of E15 Identifier Assignment. The same identifier may be assigned on more than one occasion. An identifier might be created prior to an assignment. Examples: - The identifier assignment on 1(st) June 1997 of the silver cup donated by Martin Doerr (E15) assigned “232” (E42) (fictitious) In First Order Logic: - P37(x,y) ⇒ E15(x) - P37(x,y) ⇒ E42(y) - P37(x,y) ⇒ P141(x,y)
domain: E15 Identifier Assignment
label: P37 a assigné @fr
label: P37 atribuiu @pt
label: P37 wies zu @de
label: P37 απέδωσε @el
label: P37 назначил @ru
label: P37 分配了 @zh
range: E42 Identifier
sub property of: P141 assigned
inverse of: P37 was assigned by
notation: P37

P139 is alternative form of
type: ObjectProperty
type: NamedIndividual
comment: Quantification of the inverse property: many to many (0,n:0,n) Scope note of the inverse property: This property associates an instance of E41 Appellation with another instance of E41 Appellation that constitutes a derivative or variant of the former and that may also be used for identifying items identified by the former, in suitable contexts, independent from the particular item to be identified. This property should not be confused with additional variants of names used characteristically for a single, particular item, such as individual nicknames. It is a directed relationship, where the range expresses the derivative or variant and the domain the source of derivation or original form of variation, if such a direction can be established. Otherwise, the relationship is symmetric. Multiple names assigned to an object, which do not apply to all things identified with the specific instance of E41 Appellation, should be modelled as repeated values of P1 is identified by (identifies) of this object. P139.1 has type allows the type of derivation to be refined, for instance “transliteration from Latin 1 to ASCII”. Examples of the inverse property: - “Martin Doerr” (E41) has alternative form “Martin Dörr” (E41) has type alternate spelling (E55). - “Гончарова, Наталья Сергеевна” (E41) has alternative form "Gončarova, Natal´â Sergeevna" (E41) has type ISO 9:1995 transliteration (E55). - “Αθήνα” (E41) has alternative form “Athina” (E41) has type transcription (E55). In First Order Logic of the inverse property: - P139(x,y) ⇒ E41(x) - P139(x,y) ⇒ E41(y) - P139(x,y,z) ⇒ [P139(x,y) ∧ E55(z)] - ¬P139(x,x)
domain: E41 Appellation
label: P139 est la forme alternative de @fr
range: E41 Appellation
notation: P139i

P188 requires production tool
type: ObjectProperty
type: NamedIndividual
comment: Quantification: many to many (0,n:0,n) Scope note: This property associates an instance of E99 Product Type with an instance of E19 Physical Object that is needed for the production of an instance of E18 Physical Thing. When the process of production is correctly executed in accordance with the plan and using the specified instance of E19 Physical Object, the resulting instance of E18 Physical Thing is considered an exemplar of this instance of E99 Product Type. The instance of E19 Physical Object may bear distinct features that are transformed into characteristic features of the resulting instance of E18 Physical Thing. Examples include models and moulds. Examples: - Volkswagen Type 11 (Beetle) (E99) requires production tool the luggage compartment lid mould for the Volkswagen Type 11 (Beetle) (E22). [See thumbnail image of the luggage compartment lid: https://upload.wikimedia.org/wikipedia/commons/thumb/b/b5/Volkswagen_Type_1_(Auto_classique_St._Lazare_'10).jpg/220px-Volkswagen_Type_1_(Auto_classique_St._Lazare_'10).jpg)] (Rieger, 2013) In First Order Logic: - P188(x,y) ⇒ E99(x) - P188(x,y) ⇒ E19(y)
domain: E99 Product Type
label: P188 nécessite l'outil @fr
range: E19 Physical Object
inverse of: P188 is production tool for
notation: P188

P19 was intended use of
type: ObjectProperty
type: NamedIndividual
comment: Quantification: many to many (0,n:0,n) Scope note: This property relates an instance of E7 Activity with instances of E71 Human-Made Thing, created specifically for use in the activity. This is distinct from the intended use of an item in some general type of activity such as the book of common prayer which was intended for use in Church of England services (see P101 had as general use (was use of)). Examples: - Lady Diana Spencer’s wedding dress (E71) was made for Wedding of Prince Charles and Lady Diana Spencer (E7) mode of use To Be Worn (E55). (Daly, 1981) Properties: - P19.1 mode of use: E55 Type In First Order Logic: - P19(x,y) ⇒ E7(x) - P19(x,y) ⇒ E71(y) - P19(x,y,z) ⇒ [P19(x,y) ∧ E55(z)]
domain: E7 Activity
label: P19 a été l’usage prévu de @fr
label: P19 era prevista a utilização de @pt
label: P19 war beabsichtigteter Gebrauch von @de
label: P19 ήταν προορισμένη χρήση του @el
label: P19 был предполагаемым использованием для @ru
label: P19 特定用途是 @zh
range: E71 Human-Made Thing
inverse of: P19 was made for
notation: P19

P48 has preferred identifier
type: ObjectProperty
type: NamedIndividual
comment: Quantification: many to one (0,1:0,n) Scope note: This property records the preferred instance of E42 Identifier that was used to identify an instance of E1 CRM Entity at the time this property was recorded. More than one preferred identifier may have been assigned to an item over time. Use of this property requires an external mechanism for assigning temporal validity to the respective CIDOC CRM instance. The fact that an identifier is a preferred one for an organisation can be better expressed in a context independent form by assigning a suitable instance of E55 Type to the respective instance of E15 Identifier Assignment using the P2 has type property. Examples: - The pair of Lederhosen donated by Dr. Martin Doerr (E22) has preferred identifier “OXCMS:2001.1.32” (E42). (fictitious) In First Order Logic: - P48(x,y) ⇒ E1(x) - P48(x,y) ⇒ E42(y) - P48(x,y) ⇒ P1(x,y)
domain: E1 CRM Entity
label: P48 a pour identifiant préférentiel @fr
label: P48 hat bevorzugtes Kennzeichen @de
label: P48 tem identificador preferido @pt
label: P48 έχει προτιμώμενο αναγνωριστικό @el
label: P48 имеет предпочтительный идентификатор @ru
label: P48 有优选标识符 @zh
range: E42 Identifier
sub property of: P1 is identified by
inverse of: P48 is preferred identifier of
notation: P48

P97 was father for
type: ObjectProperty
type: NamedIndividual
comment: Quantification of the inverse property: many to one, necessary (1,1:0,n) Scope note of the inverse property: This property links an instance of E67 Birth to an instance of E21 Person in the role of biological father. Note that biological fathers are not seen as necessary participants in the birth, whereas birth-giving mothers are (see P96 by mother (gave birth)). The Person being born is linked to the Birth with the property P98 brought into life (was born). This is not intended for use with general natural history material, only people. There is no explicit method for modelling conception and gestation except by using extensions. An instance of E67 Birth is normally (but not always) associated with one biological father. Examples of the inverse property: - King George VI (E21) was father for the birth of Queen Elizabeth II (E67). (Parker, 2002) In First Order Logic of the inverse property: - P97(x,y) ⇒ E67(x) - P97(x,y) ⇒ E21(y)
domain: E21 Person
label: P97 a été le père pour @fr
label: P97 foi pai para @pt
label: P97 war Vater für @de
label: P97 ήταν πατέρας του/της @el
label: P97 был отцом для @ru
label: P97 是父亲 @zh
range: E67 Birth
notation: P97i

P86 contains
type: ObjectProperty
type: TransitiveProperty
type: NamedIndividual
comment: Quantification of the inverse property: many to many (0,n:0,n) Scope note of the inverse property: This property describes the inclusion relationship between two instances of E52 Time-Span. This property supports the notion that the temporal extent of an instance of E52 Time-Span falls within the temporal extent of another instance of E52 Time-Span. It addresses temporal containment only, and no contextual link between the two instances of E52 Time-Span is implied. This property is transitive and reflexive. Examples of the inverse property: - The time-span of the Apollo 11 moon mission (E52) falls within the time-span of the reign of Queen Elizabeth II (E52). (Riley, 2009; Robinson, 2000) In First Order Logic of the inverse property: - P86(x,y) ⇒ E52(x) - P86(x,y) ⇒ E52(y) - [P86(x,y) ∧ P86(y,z)] ⇒ P86(x,z) - P86(x,x)
domain: E52 Time-Span
label: P86 contient @fr
label: P86 contém @pt
label: P86 enthält @de
label: P86 περιέχει @el
label: P86 содержит @ru
label: P86 包含 @zh
range: E52 Time-Span
notation: P86i

E85 Joining
type: Class
type: NamedIndividual
comment: Scope note: This class comprises the activities that result in an instance of E39 Actor becoming a member of an instance of E74 Group. This class does not imply initiative by either party. It may be the initiative of a third party. Typical scenarios include becoming a member of a social organisation, becoming an employee of a company, marriage, the adoption of a child by a family, and the inauguration of somebody into an official position. Examples: - the election of Sir Isaac Newton as Member of Parliament for the University of Cambridge to the Convention Parliament of 1689 (Gleick, 2003) - the inauguration of Mikhail Sergeyevich Gorbachev as leader of the Union of Soviet Socialist Republics (USSR) in 1985 (Butson, 1986) - the implementation of the membership treaty between EU and Denmark, 1(st) January 1993 In First Order Logic: - E85(x) ⇒ E7(x)
label: E85 Adhésion @fr
label: E85 Beitritt @de
label: E85 加入 @zh
subclass of: E7 Activity
subclass of: Restriction
  min cardinality: 1
  on property: P144 joined with
subclass of: Restriction
  cardinality: 1
  on property: P143 joined
notation: E85

P189 is approximated by
type: ObjectProperty
type: NamedIndividual
comment: Quantification of the inverse property: many to many (0,n:0,n) Scope note of the inverse property: This property associates an instance of E53 Place with another instance of E53 Place, which is defined in the same reference space, and which is used to approximate the former. The property does not necessarily state the quality or accuracy of this approximation, but rather indicates the use of the first instance of place to approximate the second. In common documentation practice, find or encounter spots e.g. in archaeology, botany or zoology are often related to the closest village, river or other named place without detailing the relation, e.g. if it is located within the village or in a certain distance of the specified place. In this case the stated “phenomenal” place found in the documentation can be seen as an approximation of the actual encounter spot without more specific knowledge. In more recent documentation often point coordinate information is provided that originates from GPS measurements or georeferencing from a map. This point coordinate information does not state the actual place of the encounter spot but tries to approximate it with a “declarative” place. The accuracy depends on the methodology used when creating the coordinates. It may be dependent on technical limitations like GPS accuracy but also on the method where the GPS location is taken in relation to the measured feature. If the methodology is known a maximum deviation from the measured point can be calculated and the encounter spot or feature may be related to the resulting circle using an instance of P171 at some place within. This property is not transitive. This property is reflexive. Examples of the inverse property: - [40°31'17.9"N 21°15'48.3"E] (E53) approximates Kastoria, Greece, TGN ID: 7010880 (E53). [The approximating declarative place with point shape is defined in terms of coordinates taken from https://sws.geonames.org/735927] - [40°31'00.1"N 21°16'00.1"E] (E53) approximates K…
domain: E53 Place
label: P189 est approximé par @fr
range: E53 Place
notation: P189i